{"text_format":"1","workbook":"xlsx","n_sheets":12,"sheets":["1ERPA","1ERPM","1ERPRE","2DOPA","2DOPM","2DOPRE","3ERPA","3ERPRE","3ERPM","CIERRE","RUBRICA","Hoja1"],"not_rendered":{"charts":0,"images":1,"macros":1,"external_links":0,"defined_names":0,"comments":0,"pivot_tables":0},"unopened":[],"bounds":{"document_bytes":16777216,"sheet_cells":100000,"rows_first":2000,"rows_last":500,"rows_between":2000,"halvings":0,"cell_chars":16384,"cell_head_chars":4096},"cells_cut":0,"cells_raw":0,"read":"whole","date_system":"1900"}

{"sheet":"1ERPA","index":0,"n_rows":66,"n_cols":43,"rows_kept":66,"cut":false,"hidden":false,"merged":[[14,40,15,40],[1,16,1,21],[1,22,1,24],[2,0,2,42],[8,36,13,36],[8,37,13,37],[8,38,13,38],[9,23,9,34],[10,23,10,34],[11,6,11,35],[12,20,12,21],[12,6,12,19],[12,22,12,35],[0,0,0,42],[4,12,4,23],[4,29,4,34],[6,10,6,12],[9,39,13,40],[9,41,15,41],[9,42,13,42],[7,37,7,41],[8,0,15,0],[8,5,15,5],[14,36,15,36],[14,37,15,37],[14,38,15,38],[14,42,15,42],[8,39,8,42],[14,39,15,39]]}
["CONTROL DE ASISTENCIA Y EVALUACIONES"]
[null,null,null,null,null,null,null,null,null,null,null,null,null,null,null,null,"CICLO ESCOLAR ",null,null,null,null,null,"2018-2019"]
["PRIMER PARCIAL"]
[]
[null,null,null,null,null,null,null,null,null,null,null,"LICENCIATURA EN: ","Ingeniería en Sistemas Computacionales",null,null,null,null,null,null,null,null,null,null,null,null,null,null,null,"ASIGNATURA: ","SEGURIDAD INFORMÁTICA Y DE REDES"]
[]
[null,null,null,null,null,null,null,null,null,"CUATRIMESTRE:","QUINTO",null,null,null,null,"GRUPO:","A",null,null,null,"PERIODO: ","A"]
[]
["No.",null,null,null,null,"NOMBRE DEL ALUMNO",null,"SIMBOLOGIA:",null,null,null,"A:","ASISTENCIA",null,null,null,null,null,null,null,null,null,null,null,null,null,null,null,null,null,null,null,null,null,null,null,"CLASES IMPARTIDAS","TOTAL FALTAS","% ASISTENCIA","EVALUACIÓN"]
[null,null,null,null,null,null,null,null,null,null,null,"F:","FALTA",null,null,null,null,null,null,null,null,null,null,"ALDO ORTEGA PACHECO",null,null,null,null,null,null,null,null,null,null,null,null,null,null,null,"CALIFICACIÓN",null,"CALIF. CON LETRA","% PARCIAL"]
[null,null,null,null,null,null,null,null,null,null,null,"J:","JUSTIFICACIÓN",null,null,null,null,null,null,null,null,null,null,"NOMBRE Y FIRMA DEL CATEDRÁTICO"]
[null,null,null,null,null,null,"PRIMER PARCIAL"]
[null,null,null,null,null,null,"MARZO",null,null,null,null,null,null,null,null,null,null,null,null,null,"-",null,"MAYO"]
[null,null,null,null,null,null,"Ma","Mi","Ma","Mi","Ma","Mi","Ma","Mi","Ma","Mi","Ma","Mi",null,"Ma","Mi","Ma","Mi"]
[null,null,null,null,null,null,29,30,5,{"$f":"I15+1","v":6},{"$f":"J15+6","v":12},{"$f":"K15+1","v":13},{"$f":"L15+6","v":19},{"$f":"M15+1","v":20},{"$f":"N15+6","v":26},{"$f":"O15+1","v":27},3,{"$f":"Q15+1","v":4},null,29,30,5,6,null,null,null,null,null,null,null,null,null,null,null,null,null,{"$f":"COUNT(G15:AJ15)","v":16},{"$f":"SUM(AL17:AL24)","v":1},{"$f":"100/AK15","v":6.25},"%","T",null,25]
[null,null,{"$f":"COUNTIF(C17:C66,\"=1\")","v":0},{"$f":"COUNTIF(D17:D66,\"=1\")","v":0},{"$f":"C16+D16","v":0},null,2,1,2,1,2,1,2,1,2,1,2,1,null,2,1,2,1]
[{"$f":"IF(F17=\"\",\"\",1)","v":1},{"$f":"AO17","v":9},{"$f":"IF(B17=\"SD/F\",1,0)","v":0},{"$f":"IF(B17<6,1,0)","v":0},{"$f":"IF(B17=\"SD/F\",1,IF(B17<6,1,0))","v":0},"GUZMAN SANTOS ALAN","A","A","A","A","A","A","A","A","A","A","A","A",null,"A",null,null,null,null,null,null,null,null,null,null,null,null,null,null,null,null,{"$f":"IF(G17=\"\",\"\",COUNTIF(G17:AJ17,\"A\")+COUNTIF(G17:AJ17,\"J\"))","v":13},{"$f":"IF(AK17=\"\",\"\",COUNTIF(G17:AJ17,\"F\"))","v":0},{"$f":"IF(AK17=\"\",\"\",($AK$15-AL17)*$AM$15)","v":100},{"$f":"IF('1ERPM'!W20=\"\",\"\",IF('1ERPM'!W20=0,0,('1ERPM'!W20)*100))","v":94},{"$f":"IF(AM17<80,\"SD/F\",IF(AN17=\"\",\"\",IF(AN17>=96,10,IF(AN17>=86,9,IF(AN17>=76,8,IF(AN17>=66,7,IF(AN17>=56,6,IF(AN17>=46,5,IF(AN17>=36,4,IF(AN17>=26,3,IF(AN17>=16,2,IF(AN17>=6,1,IF(AN17>=0,0,\"\")))))))))))))","v":9},{"$f":"IF(AM17<80,\"SD/F\",IF(AO17=\"\",\"\",IF(AO17>=9.6,\"DIEZ\",IF(AO17>=8.6,\"NUEVE\",IF(AO17>=7.6,\"OCHO\",IF(AO17>=6.6,\"SIETE\",IF(AO17>=5.6,\"SEIS\",IF(AO17>=4.6,\"CINCO\",IF(AO17>=3.6,\"CUATRO\",IF(AO17>=2.6,\"TRES\",IF(AO17>=1.6,\"DOS\",IF(AO17>=0.6,\"UNO\",IF(AO17>=0,\"CERO\",\"\")))))))))))))","v":"NUEVE"},{"$f":"IF(AP17=\"\",\"\",IF(AP17=\"SD/F\",0,($AQ$15/10)*AO17))","v":22.5}]
[{"$f":"IF(F18=\"\",\"\",A17+1)","v":2},9,{"$f":"IF(B18=\"SD/F\",1,0)","v":0},{"$f":"IF(B18<6,1,0)","v":0},{"$f":"IF(B18=\"SD/F\",E17+1,IF(B18<6,E17+1,E17))","v":0},"ILLAN MONJARDIN JOSE LUIS","A","A","A","A","A","A","A","A","A","A","A","A",null,null,null,null,null,null,null,null,null,null,null,null,null,null,null,null,null,null,{"$f":"IF(G18=\"\",\"\",COUNTIF(G18:AJ18,\"A\")+COUNTIF(G18:AJ18,\"J\"))","v":12},{"$f":"IF(AK18=\"\",\"\",COUNTIF(G18:AJ18,\"F\"))","v":0},{"$f":"IF(AK18=\"\",\"\",($AK$15-AL18)*$AM$15)","v":100},{"$f":"IF('1ERPM'!W21=\"\",\"\",IF('1ERPM'!W21=0,0,('1ERPM'!W21)*100))","v":94},{"$f":"IF(AM18<80,\"SD/F\",IF(AN18=\"\",\"\",IF(AN18>=96,10,IF(AN18>=86,9,IF(AN18>=76,8,IF(AN18>=66,7,IF(AN18>=56,6,IF(AN18>=46,5,IF(AN18>=36,4,IF(AN18>=26,3,IF(AN18>=16,2,IF(AN18>=6,1,IF(AN18>=0,0,\"\")))))))))))))","v":9},{"$f":"IF(AM18<80,\"SD/F\",IF(AO18=\"\",\"\",IF(AO18>=9.6,\"DIEZ\",IF(AO18>=8.6,\"NUEVE\",IF(AO18>=7.6,\"OCHO\",IF(AO18>=6.6,\"SIETE\",IF(AO18>=5.6,\"SEIS\",IF(AO18>=4.6,\"CINCO\",IF(AO18>=3.6,\"CUATRO\",IF(AO18>=2.6,\"TRES\",IF(AO18>=1.6,\"DOS\",IF(AO18>=0.6,\"UNO\",IF(AO18>=0,\"CERO\",\"\")))))))))))))","v":"NUEVE"},{"$f":"IF(AP18=\"\",\"\",IF(AP18=\"SD/F\",0,($AQ$15/10)*AO18))","v":22.5}]
[{"$f":"IF(F19=\"\",\"\",A18+1)","v":3},8,0,0,{"$f":"IF(B19=\"SD/F\",E18+1,IF(B19<6,E18+1,E18))","v":0},"LA MADRID GONZALEZ FERNANDA ISABEL ","A","A","A","A","A","A","A","A","A","A","A","A",null,null,null,null,null,null,null,null,null,null,null,null,null,null,null,null,null,null,12,0,100,{"$f":"IF('1ERPM'!W22=\"\",\"\",IF('1ERPM'!W22=0,0,('1ERPM'!W22)*100))","v":77.333333333333314},8,"OCHO",20]
[4,null,null,null,null,"LOPEZ CASTRO GLORIA KARINA","A","A","A","A","A","A","A","A","A","A","A","A",null,null,null,null,null,null,null,null,null,null,null,null,null,null,null,null,null,null,12,0,100,{"$f":"IF('1ERPM'!W23=\"\",\"\",IF('1ERPM'!W23=0,0,('1ERPM'!W23)*100))","v":94},9,"NUEVE",22.5]
[5,9,0,0,{"$f":"IF(B21=\"SD/F\",E19+1,IF(B21<6,E19+1,E19))","v":0},"GUZMAN SANTOS ALAN","A","A","A","A","A","A","A","A","A","A","A","A",null,null,null,null,null,null,null,null,null,null,null,null,null,null,null,null,null,null,12,0,100,{"$f":"IF('1ERPM'!W24=\"\",\"\",IF('1ERPM'!W24=0,0,('1ERPM'!W24)*100))","v":94},9,"NUEVE",22.5]
[6,9,0,0,0,"Y","A","A","A","A","A","A","A","A","A","A","A","A",null,null,null,null,null,null,null,null,null,null,null,null,null,null,null,null,null,null,12,0,100,{"$f":"IF('1ERPM'!W25=\"\",\"\",IF('1ERPM'!W25=0,0,('1ERPM'!W25)*100))","v":94},9,"NUEVE",22.5]
[7,9,0,0,0,"U","A","A","A","A","A","A","A","A","A","A","A","A",null,null,null,null,null,null,null,null,null,null,null,null,null,null,null,null,null,null,{"$f":"IF(G23=\"\",\"\",COUNTIF(G23:AJ23,\"A\")+COUNTIF(G23:AJ23,\"J\"))","v":12},{"$f":"IF(AK23=\"\",\"\",COUNTIF(G23:AJ23,\"F\"))","v":0},{"$f":"IF(AK23=\"\",\"\",($AK$15-AL23)*$AM$15)","v":100},{"$f":"IF('1ERPM'!W26=\"\",\"\",IF('1ERPM'!W26=0,0,('1ERPM'!W26)*100))","v":94},{"$f":"IF(AM23<80,\"SD/F\",IF(AN23=\"\",\"\",IF(AN23>=96,10,IF(AN23>=86,9,IF(AN23>=76,8,IF(AN23>=66,7,IF(AN23>=56,6,IF(AN23>=46,5,IF(AN23>=36,4,IF(AN23>=26,3,IF(AN23>=16,2,IF(AN23>=6,1,IF(AN23>=0,0,\"\")))))))))))))","v":9},{"$f":"IF(AM23<80,\"SD/F\",IF(AO23=\"\",\"\",IF(AO23>=9.6,\"DIEZ\",IF(AO23>=8.6,\"NUEVE\",IF(AO23>=7.6,\"OCHO\",IF(AO23>=6.6,\"SIETE\",IF(AO23>=5.6,\"SEIS\",IF(AO23>=4.6,\"CINCO\",IF(AO23>=3.6,\"CUATRO\",IF(AO23>=2.6,\"TRES\",IF(AO23>=1.6,\"DOS\",IF(AO23>=0.6,\"UNO\",IF(AO23>=0,\"CERO\",\"\")))))))))))))","v":"NUEVE"},{"$f":"IF(AP23=\"\",\"\",IF(AP23=\"SD/F\",0,($AQ$15/10)*AO23))","v":22.5}]
[8,9,0,0,0,"ILLAN MONJARDIN JOSE LUIS","A","A","A","F","A","A","A","A","A","A","A","A",null,null,null,null,null,null,null,null,null,null,null,null,null,null,null,null,null,null,11,1,93.75,{"$f":"IF('1ERPM'!W27=\"\",\"\",IF('1ERPM'!W27=0,0,('1ERPM'!W27)*100))","v":94},9,"NUEVE",22.5]
[{"$f":"IF(F25=\"\",\"\",A24+1)","v":9},{"$f":"AO25","v":9},{"$f":"IF(B25=\"SD/F\",1,0)","v":0},{"$f":"IF(B25<6,1,0)","v":0},{"$f":"IF(B25=\"SD/F\",E24+1,IF(B25<6,E24+1,E24))","v":0},"e","A","A","A","F","A","A","A","A","A","A","A","A",null,null,null,null,null,null,null,null,null,null,null,null,null,null,null,null,null,null,11,1,93.75,{"$f":"IF('1ERPM'!W28=\"\",\"\",IF('1ERPM'!W28=0,0,('1ERPM'!W28)*100))","v":94},9,"NUEVE",22.5]
[10,9,0,0,0,"f","A","A","A","F","A","A","A","A","A","A","A","A",null,null,null,null,null,null,null,null,null,null,null,null,null,null,null,null,null,null,11,1,93.75,{"$f":"IF('1ERPM'!W29=\"\",\"\",IF('1ERPM'!W29=0,0,('1ERPM'!W29)*100))","v":94},9,"NUEVE",22.5]
[11,9,0,0,0,"GUZMAN SANTOS ALAN","A","A","A","F","A","A","A","A","A","A","A","A",null,null,null,null,null,null,null,null,null,null,null,null,null,null,null,null,null,null,11,1,93.75,{"$f":"IF('1ERPM'!W30=\"\",\"\",IF('1ERPM'!W30=0,0,('1ERPM'!W30)*100))","v":94},9,"NUEVE",22.5]
[12,9,0,0,0,"h","A","A","A","F","A","A","A","A","A","A","A","A",null,null,null,null,null,null,null,null,null,null,null,null,null,null,null,null,null,null,11,1,93.75,{"$f":"IF('1ERPM'!W31=\"\",\"\",IF('1ERPM'!W31=0,0,('1ERPM'!W31)*100))","v":94},9,"NUEVE",22.5]
[13,9,0,0,0,"ILLAN MONJARDIN JOSE LUIS","A","A","A","F","F","F","A","A","A","A","A","A",null,null,null,null,null,null,null,null,null,null,null,null,null,null,null,null,null,null,9,3,81.25,{"$f":"IF('1ERPM'!W32=\"\",\"\",IF('1ERPM'!W32=0,0,('1ERPM'!W32)*100))","v":94},9,"NUEVE",22.5]
[14,9,0,0,0,"T","A","A","A","A","A","A","A","A","A","A","A","A",null,null,null,null,null,null,null,null,null,null,null,null,null,null,null,null,null,null,{"$f":"IF(G30=\"\",\"\",COUNTIF(G30:AJ30,\"A\")+COUNTIF(G30:AJ30,\"J\"))","v":12},{"$f":"IF(AK30=\"\",\"\",COUNTIF(G30:AJ30,\"F\"))","v":0},{"$f":"IF(AK30=\"\",\"\",($AK$15-AL30)*$AM$15)","v":100},{"$f":"IF('1ERPM'!W33=\"\",\"\",IF('1ERPM'!W33=0,0,('1ERPM'!W33)*100))","v":94},{"$f":"IF(AM30<80,\"SD/F\",IF(AN30=\"\",\"\",IF(AN30>=96,10,IF(AN30>=86,9,IF(AN30>=76,8,IF(AN30>=66,7,IF(AN30>=56,6,IF(AN30>=46,5,IF(AN30>=36,4,IF(AN30>=26,3,IF(AN30>=16,2,IF(AN30>=6,1,IF(AN30>=0,0,\"\")))))))))))))","v":9},{"$f":"IF(AM30<80,\"SD/F\",IF(AO30=\"\",\"\",IF(AO30>=9.6,\"DIEZ\",IF(AO30>=8.6,\"NUEVE\",IF(AO30>=7.6,\"OCHO\",IF(AO30>=6.6,\"SIETE\",IF(AO30>=5.6,\"SEIS\",IF(AO30>=4.6,\"CINCO\",IF(AO30>=3.6,\"CUATRO\",IF(AO30>=2.6,\"TRES\",IF(AO30>=1.6,\"DOS\",IF(AO30>=0.6,\"UNO\",IF(AO30>=0,\"CERO\",\"\")))))))))))))","v":"NUEVE"},{"$f":"IF(AP30=\"\",\"\",IF(AP30=\"SD/F\",0,($AQ$15/10)*AO30))","v":22.5}]
["","",0,0,0,null,null,null,null,null,null,null,null,null,null,null,null,null,null,null,null,null,null,null,null,null,null,null,null,null,null,null,null,null,null,null,"","","",{"$f":"IF('1ERPM'!W34=\"\",\"\",IF('1ERPM'!W34=0,0,('1ERPM'!W34)*100))","v":""},"","",""]
["","",0,0,0,null,null,null,null,null,null,null,null,null,null,null,null,null,null,null,null,null,null,null,null,null,null,null,null,null,null,null,null,null,null,null,"","","",{"$f":"IF('1ERPM'!W35=\"\",\"\",IF('1ERPM'!W35=0,0,('1ERPM'!W35)*100))","v":""},"","",""]
["","",0,0,0,null,null,null,null,null,null,null,null,null,null,null,null,null,null,null,null,null,null,null,null,null,null,null,null,null,null,null,null,null,null,null,"","","",{"$f":"IF('1ERPM'!W36=\"\",\"\",IF('1ERPM'!W36=0,0,('1ERPM'!W36)*100))","v":""},"","",""]
["","",0,0,0,null,null,null,null,null,null,null,null,null,null,null,null,null,null,null,null,null,null,null,null,null,null,null,null,null,null,null,null,null,null,null,"","","",{"$f":"IF('1ERPM'!W37=\"\",\"\",IF('1ERPM'!W37=0,0,('1ERPM'!W37)*100))","v":""},"","",""]
["","",0,0,0,null,null,null,null,null,null,null,null,null,null,null,null,null,null,null,null,null,null,null,null,null,null,null,null,null,null,null,null,null,null,null,"","","",{"$f":"IF('1ERPM'!W38=\"\",\"\",IF('1ERPM'!W38=0,0,('1ERPM'!W38)*100))","v":""},"","",""]
["","",0,0,0,null,null,null,null,null,null,null,null,null,null,null,null,null,null,null,null,null,null,null,null,null,null,null,null,null,null,null,null,null,null,null,"","","",{"$f":"IF('1ERPM'!W39=\"\",\"\",IF('1ERPM'!W39=0,0,('1ERPM'!W39)*100))","v":""},"","",""]
["","",0,0,0,null,null,null,null,null,null,null,null,null,null,null,null,null,null,null,null,null,null,null,null,null,null,null,null,null,null,null,null,null,null,null,"","","",{"$f":"IF('1ERPM'!W40=\"\",\"\",IF('1ERPM'!W40=0,0,('1ERPM'!W40)*100))","v":""},"","",""]
["","",0,0,0,null,null,null,null,null,null,null,null,null,null,null,null,null,null,null,null,null,null,null,null,null,null,null,null,null,null,null,null,null,null,null,"","","",{"$f":"IF('1ERPM'!W41=\"\",\"\",IF('1ERPM'!W41=0,0,('1ERPM'!W41)*100))","v":""},"","",""]
["","",0,0,0,null,null,null,null,null,null,null,null,null,null,null,null,null,null,null,null,null,null,null,null,null,null,null,null,null,null,null,null,null,null,null,"","","",{"$f":"IF('1ERPM'!W42=\"\",\"\",IF('1ERPM'!W42=0,0,('1ERPM'!W42)*100))","v":""},"","",""]
["","",0,0,0,null,null,null,null,null,null,null,null,null,null,null,null,null,null,null,null,null,null,null,null,null,null,null,null,null,null,null,null,null,null,null,"","","",{"$f":"IF('1ERPM'!W43=\"\",\"\",IF('1ERPM'!W43=0,0,('1ERPM'!W43)*100))","v":""},"","",""]
["","",0,0,0,null,null,null,null,null,null,null,null,null,null,null,null,null,null,null,null,null,null,null,null,null,null,null,null,null,null,null,null,null,null,null,"","","",{"$f":"IF('1ERPM'!W44=\"\",\"\",IF('1ERPM'!W44=0,0,('1ERPM'!W44)*100))","v":""},"","",""]
["","",0,0,0,null,null,null,null,null,null,null,null,null,null,null,null,null,null,null,null,null,null,null,null,null,null,null,null,null,null,null,null,null,null,null,"","","",{"$f":"IF('1ERPM'!W45=\"\",\"\",IF('1ERPM'!W45=0,0,('1ERPM'!W45)*100))","v":""},"","",""]
["","",0,0,0,null,null,null,null,null,null,null,null,null,null,null,null,null,null,null,null,null,null,null,null,null,null,null,null,null,null,null,null,null,null,null,"","","",{"$f":"IF('1ERPM'!W46=\"\",\"\",IF('1ERPM'!W46=0,0,('1ERPM'!W46)*100))","v":""},"","",""]
["","",0,0,0,null,null,null,null,null,null,null,null,null,null,null,null,null,null,null,null,null,null,null,null,null,null,null,null,null,null,null,null,null,null,null,"","","",{"$f":"IF('1ERPM'!W47=\"\",\"\",IF('1ERPM'!W47=0,0,('1ERPM'!W47)*100))","v":""},"","",""]
["","",0,0,0,null,null,null,null,null,null,null,null,null,null,null,null,null,null,null,null,null,null,null,null,null,null,null,null,null,null,null,null,null,null,null,"","","",{"$f":"IF('1ERPM'!W48=\"\",\"\",IF('1ERPM'!W48=0,0,('1ERPM'!W48)*100))","v":""},"","",""]
["","",0,0,0,null,null,null,null,null,null,null,null,null,null,null,null,null,null,null,null,null,null,null,null,null,null,null,null,null,null,null,null,null,null,null,"","","",{"$f":"IF('1ERPM'!W49=\"\",\"\",IF('1ERPM'!W49=0,0,('1ERPM'!W49)*100))","v":""},"","",""]
["","",0,0,0,null,null,null,null,null,null,null,null,null,null,null,null,null,null,null,null,null,null,null,null,null,null,null,null,null,null,null,null,null,null,null,"","","",{"$f":"IF('1ERPM'!W50=\"\",\"\",IF('1ERPM'!W50=0,0,('1ERPM'!W50)*100))","v":""},"","",""]
[{"$f":"IF(F48=\"\",\"\",A47+1)","v":""},"",0,0,0,null,null,null,null,null,null,null,null,null,null,null,null,null,null,null,null,null,null,null,null,null,null,null,null,null,null,null,null,null,null,null,"","","",{"$f":"IF('1ERPM'!W51=\"\",\"\",IF('1ERPM'!W51=0,0,('1ERPM'!W51)*100))","v":""},"","",""]
["","",0,0,0,null,null,null,null,null,null,null,null,null,null,null,null,null,null,null,null,null,null,null,null,null,null,null,null,null,null,null,null,null,null,null,"","","",{"$f":"IF('1ERPM'!W52=\"\",\"\",IF('1ERPM'!W52=0,0,('1ERPM'!W52)*100))","v":""},"","",""]
["","",0,0,0,null,null,null,null,null,null,null,null,null,null,null,null,null,null,null,null,null,null,null,null,null,null,null,null,null,null,null,null,null,null,null,"","","",{"$f":"IF('1ERPM'!W53=\"\",\"\",IF('1ERPM'!W53=0,0,('1ERPM'!W53)*100))","v":""},"","",""]
["","",0,0,0,null,null,null,null,null,null,null,null,null,null,null,null,null,null,null,null,null,null,null,null,null,null,null,null,null,null,null,null,null,null,null,"","","",{"$f":"IF('1ERPM'!W54=\"\",\"\",IF('1ERPM'!W54=0,0,('1ERPM'!W54)*100))","v":""},"","",""]
["","",0,0,0,null,null,null,null,null,null,null,null,null,null,null,null,null,null,null,null,null,null,null,null,null,null,null,null,null,null,null,null,null,null,null,"","","",{"$f":"IF('1ERPM'!W55=\"\",\"\",IF('1ERPM'!W55=0,0,('1ERPM'!W55)*100))","v":""},"","",""]
["","",0,0,0,null,null,null,null,null,null,null,null,null,null,null,null,null,null,null,null,null,null,null,null,null,null,null,null,null,null,null,null,null,null,null,"","","",{"$f":"IF('1ERPM'!W56=\"\",\"\",IF('1ERPM'!W56=0,0,('1ERPM'!W56)*100))","v":""},"","",""]
["","",0,0,0,null,null,null,null,null,null,null,null,null,null,null,null,null,null,null,null,null,null,null,null,null,null,null,null,null,null,null,null,null,null,null,"","","",{"$f":"IF('1ERPM'!W57=\"\",\"\",IF('1ERPM'!W57=0,0,('1ERPM'!W57)*100))","v":""},"","",""]
["","",0,0,0,null,null,null,null,null,null,null,null,null,null,null,null,null,null,null,null,null,null,null,null,null,null,null,null,null,null,null,null,null,null,null,"","","",{"$f":"IF('1ERPM'!W58=\"\",\"\",IF('1ERPM'!W58=0,0,('1ERPM'!W58)*100))","v":""},"","",""]
["","",0,0,0,null,null,null,null,null,null,null,null,null,null,null,null,null,null,null,null,null,null,null,null,null,null,null,null,null,null,null,null,null,null,null,"","","",{"$f":"IF('1ERPM'!W59=\"\",\"\",IF('1ERPM'!W59=0,0,('1ERPM'!W59)*100))","v":""},"","",""]
["","",0,0,0,null,null,null,null,null,null,null,null,null,null,null,null,null,null,null,null,null,null,null,null,null,null,null,null,null,null,null,null,null,null,null,"","","",{"$f":"IF('1ERPM'!W60=\"\",\"\",IF('1ERPM'!W60=0,0,('1ERPM'!W60)*100))","v":""},"","",""]
["","",0,0,0,null,null,null,null,null,null,null,null,null,null,null,null,null,null,null,null,null,null,null,null,null,null,null,null,null,null,null,null,null,null,null,"","","",{"$f":"IF('1ERPM'!W61=\"\",\"\",IF('1ERPM'!W61=0,0,('1ERPM'!W61)*100))","v":""},"","",""]
["","",0,0,0,null,null,null,null,null,null,null,null,null,null,null,null,null,null,null,null,null,null,null,null,null,null,null,null,null,null,null,null,null,null,null,"","","",{"$f":"IF('1ERPM'!W62=\"\",\"\",IF('1ERPM'!W62=0,0,('1ERPM'!W62)*100))","v":""},"","",""]
["","",0,0,0,null,null,null,null,null,null,null,null,null,null,null,null,null,null,null,null,null,null,null,null,null,null,null,null,null,null,null,null,null,null,null,"","","",{"$f":"IF('1ERPM'!W63=\"\",\"\",IF('1ERPM'!W63=0,0,('1ERPM'!W63)*100))","v":""},"","",""]
["","",0,0,0,null,null,null,null,null,null,null,null,null,null,null,null,null,null,null,null,null,null,null,null,null,null,null,null,null,null,null,null,null,null,null,"","","",{"$f":"IF('1ERPM'!W64=\"\",\"\",IF('1ERPM'!W64=0,0,('1ERPM'!W64)*100))","v":""},"","",""]
["","",0,0,0,null,null,null,null,null,null,null,null,null,null,null,null,null,null,null,null,null,null,null,null,null,null,null,null,null,null,null,null,null,null,null,"","","",{"$f":"IF('1ERPM'!W65=\"\",\"\",IF('1ERPM'!W65=0,0,('1ERPM'!W65)*100))","v":""},"","",""]
["","",0,0,0,null,null,null,null,null,null,null,null,null,null,null,null,null,null,null,null,null,null,null,null,null,null,null,null,null,null,null,null,null,null,null,"","","",{"$f":"IF('1ERPM'!W66=\"\",\"\",IF('1ERPM'!W66=0,0,('1ERPM'!W66)*100))","v":""},"","",""]
["","",0,0,0,null,null,null,null,null,null,null,null,null,null,null,null,null,null,null,null,null,null,null,null,null,null,null,null,null,null,null,null,null,null,null,"","","",{"$f":"IF('1ERPM'!W67=\"\",\"\",IF('1ERPM'!W67=0,0,('1ERPM'!W67)*100))","v":""},"","",""]
["","",0,0,0,null,null,null,null,null,null,null,null,null,null,null,null,null,null,null,null,null,null,null,null,null,null,null,null,null,null,null,null,null,null,null,"","","",{"$f":"IF('1ERPM'!W68=\"\",\"\",IF('1ERPM'!W68=0,0,('1ERPM'!W68)*100))","v":""},"","",""]
["","",0,0,0,null,null,null,null,null,null,null,null,null,null,null,null,null,null,null,null,null,null,null,null,null,null,null,null,null,null,null,null,null,null,null,"","","",{"$f":"IF('1ERPM'!W69=\"\",\"\",IF('1ERPM'!W69=0,0,('1ERPM'!W69)*100))","v":""},"","",""]

{"sheet":"1ERPM","index":1,"n_rows":69,"n_cols":25,"rows_kept":69,"cut":false,"hidden":false,"merged":[[11,15,11,20],[10,15,10,20],[0,4,2,22],[13,8,14,17],[13,18,14,19],[14,3,14,5],[13,22,18,22],[15,12,16,13],[15,14,16,15],[15,16,16,17],[3,20,3,21],[4,21,4,22],[13,0,18,0],[13,1,18,1],[13,2,13,7],[13,20,14,21],[15,18,16,19],[15,8,16,9],[15,10,16,11],[15,2,17,2],[15,3,17,3],[15,4,17,4],[15,5,17,5],[15,6,17,6],[15,7,17,7],[15,20,18,20],[15,21,18,21]]}
[null,null,null,null,"MATRIZ DE EVALUACIÓN"]
[]
[]
[null,null,null,null,null,null,null,null,null,null,null,null,null,null,null,null,null,null,null,null,"CICLO ESCOLAR ",null,{"$f":"IF('1ERPA'!W2=\"\",\"\",'1ERPA'!W2)","v":"2018-2019"}]
[null,null,null,null,null,null,null,null,null,null,null,null,null,null,null,null,null,null,null,null,null,{"$f":"IF('1ERPA'!A3=\"\",\"\",'1ERPA'!A3)","v":"PRIMER PARCIAL"}]
[]
[null,"LICENCIATURA EN:",{"$f":"IF('1ERPA'!M5=\"\",\"\",'1ERPA'!M5)","v":"Ingeniería en Sistemas Computacionales"}]
[null,"ASIGNATURA:",{"$f":"IF('1ERPA'!AD5=\"\",\"\",'1ERPA'!AD5)","v":"SEGURIDAD INFORMÁTICA Y DE REDES"}]
[null,{"$f":"'1ERPA'!J7","v":"CUATRIMESTRE:"},{"$f":"IF('1ERPA'!K7=\"\",\"\",'1ERPA'!K7)","v":"QUINTO"}]
[null,"GRUPO:",{"$f":"IF('1ERPA'!Q7=\"\",\"\",'1ERPA'!Q7)","v":"A"}]
[null,"PERIODO:",{"$f":"IF('1ERPA'!V7=\"\",\"\",'1ERPA'!V7)","v":"A"},null,null,null,null,null,null,null,null,null,null,null,null,{"$f":"IF('1ERPA'!X10=\"\",\"\",'1ERPA'!X10)","v":"ALDO ORTEGA PACHECO"}]
[null,"COMPETENCIA:","Aplicar procedimientos, estrategias y herramientas que permitan garantizar la integridad, la disponibilidad y la confidencialidad de la información de una entidad.",null,null,null,null,null,null,null,null,null,null,null,null,"NOMBRE Y FIRMA DEL CATEDRÁTICO"]
[null,null,"Investigar los tipos de ataques que se pueden presentar en un sistema informático para prevenir y corregir cada uno de ellos."]
["No.","Alumnos","Indicadores de desempeño",null,null,null,null,null,{"$f":"IF(H15>S14,\"POR ENCIMA DEL PORCENTAJE\",IF(H15<S14,\"POR DEBAJO DEL PORCENTAJE\",\" Evaluación de evidencias de aprendizaje\"))","v":" Evaluación de evidencias de aprendizaje"},null,null,null,null,null,null,null,null,null,0.5,null,"Fines Formativos",null,"SUMA TOTAL"]
[null,null,{"$f":"SUM(C19:H19)","v":0.5},{"$f":"IF(C15>G15,\"POR ENCIMA DEL PORCENTAJE\",IF(C15<G15,\"POR DEBAJO DEL PORCENTAJE\",\"(Niveles de dominio)\"))","v":"(Niveles de dominio)"},null,null,0.5,{"$f":"SUM(J19,L19,N19,P19,R19,T19)","v":0.5}]
[null,null,"ID1. \nSin nivel \nIdentifica un Login\nPre-formal\nElige un lenguaje para la construcción de un Login\nReceptivo\nConstruye un Login algoritmicamente\nEstratégico\nRealiza un Login, mostrando la identificación y autentificación","ID1. \nSin nivel \nIdentifica un Login\nPre-formal\nElige un lenguaje para la construcción de un Login\nReceptivo\nConstruye un Login algoritmicamente\nEstratégico\nRealiza un Login, mostrando la identificación y autentificación",null,null,null,null,"EA1: Realiza una presentación en PowerPoint mostrando los conocimientos adquiridos.",null,null,null,null,null,null,null,null,null,null,null,"Autoevaluación","Coevaluación"]
[]
[null,null,null,null,null,null,null,null,"C","P","C","P","C","P","C","P","C","P","C","P"]
[null,null,0.3,0.2,null,null,null,null,9,0.5]
[{"$f":"IF(B20=\"\",\"\",1)","v":1},{"$f":"IF('1ERPA'!F17=\"\",\"\",'1ERPA'!F17)","v":"GUZMAN SANTOS ALAN"},"Estratégico","Receptivo",null,null,null,null,9,{"$f":"IF(I20=\"\",\"\",($J$19/$I$19)*I20)","v":0.5},null,{"$f":"IF(K20=\"\",\"\",($L$19/$K$19)*K20)","v":""},null,{"$f":"IF(M20=\"\",\"\",($N$19/$M$19)*M20)","v":""},null,{"$f":"IF(O20=\"\",\"\",($P$19/$O$19)*O20)","v":""},null,{"$f":"IF(Q20=\"\",\"\",($R$19/$Q$19)*Q20)","v":""},null,{"$f":"IF(S20=\"\",\"\",($T$19/$S$19)*S20)","v":""},null,null,{"$f":"IF(B20=\"\",\"\",(IF(B20=\"\",0,IF(C20=\"Sin Nivel\",($C$19)*0,IF(C20=\"Pre-Formal\",($C$19)*60%,IF(C20=\"Receptivo\",($C$19)*70%,IF(C20=\"Resolutivo\",($C$19)*80%,IF(C20=\"Autónomo\",($C$19)*90%,IF(C20=\"Estratégico\",($C$19)*100%,0)))))))+IF(D20=\"\",0,IF(D20=\"Sin Nivel\",($D$19)*0,IF(D20=\"Pre-Formal\",($D$19)*60%,IF(D20=\"Receptivo\",($D$19)*70%,IF(D20=\"Resolutivo\",($D$19)*80%,IF(D20=\"Autónomo\",($D$19)*90%,IF(D20=\"Estratégico\",($D$19)*100%,0)))))))+IF(E20=\"\",0,IF(E20=\"Sin Nivel\",($E$19)*0,IF(E20=\"Pre-Formal\",($E$19)*60%,IF(E20=\"Receptivo\",($E$19)*70%,IF(E20=\"Resolutivo\",($E$19)*80%,IF(E20=\"Autónomo\",($E$19)*90%,IF(E20=\"Estratégico\",($E$19)*100%,0)))))))+IF(F20=\"\",0,IF(F20=\"Sin Nivel\",($F$19)*0,IF(F20=\"Pre-Formal\",($F$19)*60%,IF(F20=\"Receptivo\",($F$19)*70%,IF(F20=\"Resolutivo\",($F$19)*80%,IF(F20=\"Autónomo\",($F$19)*90%,IF(F20=\"Estratégico\",($F$19)*100%,0)))))))+IF(G20=\"\",0,IF(G20=\"Sin Nivel\",($G$19)*0,IF(G20=\"Pre-Formal\",($G$19)*60%,IF(G20=\"Receptivo\",($G$19)*70%,IF(G20=\"Resolutivo\",($G$19)*80%,IF(G20=\"Autónomo\",($G$19)*90%,IF(G20=\"Estratégico\",($G$19)*100%,0)))))))+IF(H20=\"\",0,IF(H20=\"Sin Nivel\",($H$19)*0,IF(H20=\"Pre-Formal\",($H$19)*60%,IF(H20=\"Receptivo\",($H$19)*70%,IF(H20=\"Resolutivo\",($H$19)*80%,IF(H20=\"Autónomo\",($H$19)*90%,IF(H20=\"Estratégico\",($H$19)*100%,0))))))))+SUM(J20,L20,N20,P20,R20,T20))","v":0.94},{"$f":"IF(C20=\"\",\"\",(IF(C20=\"\",0,IF(C20=\"Sin Nivel\",($C$19/5)*0,IF(C20=\"Pre-Formal\",($C$19/5)*1,IF(C20=\"Receptivo\",($C$19/5)*2,IF(C20=\"Resolutivo\",($C$19/5)*3,IF(C20=\"Autónomo\",($C$19/5)*4,IF(C20=\"Estratégico\",($C$19/5)*5,0)))))))+IF(D20=\"\",0,IF(D20=\"Sin Nivel\",($D$19/5)*0,IF(D20=\"Pre-Formal\",($D$19/5)*1,IF(D20=\"Receptivo\",($D$19/5)*2,IF(D20=\"Resolutivo\",($D$19/5)*3,IF(D20=\"Autónomo\",($D$19/5)*4,IF(D20=\"Estratégico\",($D$19/5)*5,0)))))))+IF(E20=\"\",0,IF(E20=\"Sin Nivel\",($E$19/5)*0,IF(E20=\"Pre-Formal\",($E$19/5)*1,IF(E20=\"Receptivo\",($E$19/5)*2,IF(E20=\"Resolutivo\",($E$19/5)*3,IF(E20=\"Autónomo\",($E$19/5)*4,IF(E20=\"Estratégico\",($E$19/5)*5,0)))))))+IF(F20=\"\",0,IF(F20=\"Sin Nivel\",($F$19/5)*0,IF(F20=\"Pre-Formal\",($F$19/5)*1,IF(F20=\"Receptivo\",($F$19/5)*2,IF(F20=\"Resolutivo\",($F$19/5)*3,IF(F20=\"Autónomo\",($F$19/5)*4,IF(F20=\"Estratégico\",($F$19/5)*5,0)))))))+IF(G20=\"\",0,IF(G20=\"Sin Nivel\",($G$19/5)*0,IF(G20=\"Pre-Formal\",($G$19/5)*1,IF(G20=\"Receptivo\",($G$19/5)*2,IF(G20=\"Resolutivo\",($G$19/5)*3,IF(G20=\"Autónomo\",($G$19/5)*4,IF(G20=\"Estratégico\",($G$19/5)*5,0)))))))+IF(H20=\"\",0,IF(H20=\"Sin Nivel\",($H$19/5)*0,IF(H20=\"Pre-Formal\",($H$19/5)*1,IF(H20=\"Receptivo\",($H$19/5)*2,IF(H20=\"Resolutivo\",($H$19/5)*3,IF(H20=\"Autónomo\",($H$19/5)*4,IF(H20=\"Estratégico\",($H$19/5)*5,0)))))))))","v":0.38},{"$f":"SUM(J20,L20,N20,P20,R20,T20)","v":0.5}]
[{"$f":"IF(B21=\"\",\"\",A20+1)","v":2},{"$f":"IF('1ERPA'!F18=\"\",\"\",'1ERPA'!F18)","v":"ILLAN MONJARDIN JOSE LUIS"},"Estratégico","Receptivo",null,null,null,null,9,0.5,null,"",null,"",null,"",null,{"$f":"IF(Q21=\"\",\"\",($R$19/$Q$19)*Q21)","v":""},null,{"$f":"IF(S21=\"\",\"\",($T$19/$S$19)*S21)","v":""},null,null,{"$f":"IF(B21=\"\",\"\",(IF(B21=\"\",0,IF(C21=\"Sin Nivel\",($C$19)*0,IF(C21=\"Pre-Formal\",($C$19)*60%,IF(C21=\"Receptivo\",($C$19)*70%,IF(C21=\"Resolutivo\",($C$19)*80%,IF(C21=\"Autónomo\",($C$19)*90%,IF(C21=\"Estratégico\",($C$19)*100%,0)))))))+IF(D21=\"\",0,IF(D21=\"Sin Nivel\",($D$19)*0,IF(D21=\"Pre-Formal\",($D$19)*60%,IF(D21=\"Receptivo\",($D$19)*70%,IF(D21=\"Resolutivo\",($D$19)*80%,IF(D21=\"Autónomo\",($D$19)*90%,IF(D21=\"Estratégico\",($D$19)*100%,0)))))))+IF(E21=\"\",0,IF(E21=\"Sin Nivel\",($E$19)*0,IF(E21=\"Pre-Formal\",($E$19)*60%,IF(E21=\"Receptivo\",($E$19)*70%,IF(E21=\"Resolutivo\",($E$19)*80%,IF(E21=\"Autónomo\",($E$19)*90%,IF(E21=\"Estratégico\",($E$19)*100%,0)))))))+IF(F21=\"\",0,IF(F21=\"Sin Nivel\",($F$19)*0,IF(F21=\"Pre-Formal\",($F$19)*60%,IF(F21=\"Receptivo\",($F$19)*70%,IF(F21=\"Resolutivo\",($F$19)*80%,IF(F21=\"Autónomo\",($F$19)*90%,IF(F21=\"Estratégico\",($F$19)*100%,0)))))))+IF(G21=\"\",0,IF(G21=\"Sin Nivel\",($G$19)*0,IF(G21=\"Pre-Formal\",($G$19)*60%,IF(G21=\"Receptivo\",($G$19)*70%,IF(G21=\"Resolutivo\",($G$19)*80%,IF(G21=\"Autónomo\",($G$19)*90%,IF(G21=\"Estratégico\",($G$19)*100%,0)))))))+IF(H21=\"\",0,IF(H21=\"Sin Nivel\",($H$19)*0,IF(H21=\"Pre-Formal\",($H$19)*60%,IF(H21=\"Receptivo\",($H$19)*70%,IF(H21=\"Resolutivo\",($H$19)*80%,IF(H21=\"Autónomo\",($H$19)*90%,IF(H21=\"Estratégico\",($H$19)*100%,0))))))))+SUM(J21,L21,N21,P21,R21,T21))","v":0.94},{"$f":"IF(C21=\"\",\"\",(IF(C21=\"\",0,IF(C21=\"Sin Nivel\",($C$19/5)*0,IF(C21=\"Pre-Formal\",($C$19/5)*1,IF(C21=\"Receptivo\",($C$19/5)*2,IF(C21=\"Resolutivo\",($C$19/5)*3,IF(C21=\"Autónomo\",($C$19/5)*4,IF(C21=\"Estratégico\",($C$19/5)*5,0)))))))+IF(D21=\"\",0,IF(D21=\"Sin Nivel\",($D$19/5)*0,IF(D21=\"Pre-Formal\",($D$19/5)*1,IF(D21=\"Receptivo\",($D$19/5)*2,IF(D21=\"Resolutivo\",($D$19/5)*3,IF(D21=\"Autónomo\",($D$19/5)*4,IF(D21=\"Estratégico\",($D$19/5)*5,0)))))))+IF(E21=\"\",0,IF(E21=\"Sin Nivel\",($E$19/5)*0,IF(E21=\"Pre-Formal\",($E$19/5)*1,IF(E21=\"Receptivo\",($E$19/5)*2,IF(E21=\"Resolutivo\",($E$19/5)*3,IF(E21=\"Autónomo\",($E$19/5)*4,IF(E21=\"Estratégico\",($E$19/5)*5,0)))))))+IF(F21=\"\",0,IF(F21=\"Sin Nivel\",($F$19/5)*0,IF(F21=\"Pre-Formal\",($F$19/5)*1,IF(F21=\"Receptivo\",($F$19/5)*2,IF(F21=\"Resolutivo\",($F$19/5)*3,IF(F21=\"Autónomo\",($F$19/5)*4,IF(F21=\"Estratégico\",($F$19/5)*5,0)))))))+IF(G21=\"\",0,IF(G21=\"Sin Nivel\",($G$19/5)*0,IF(G21=\"Pre-Formal\",($G$19/5)*1,IF(G21=\"Receptivo\",($G$19/5)*2,IF(G21=\"Resolutivo\",($G$19/5)*3,IF(G21=\"Autónomo\",($G$19/5)*4,IF(G21=\"Estratégico\",($G$19/5)*5,0)))))))+IF(H21=\"\",0,IF(H21=\"Sin Nivel\",($H$19/5)*0,IF(H21=\"Pre-Formal\",($H$19/5)*1,IF(H21=\"Receptivo\",($H$19/5)*2,IF(H21=\"Resolutivo\",($H$19/5)*3,IF(H21=\"Autónomo\",($H$19/5)*4,IF(H21=\"Estratégico\",($H$19/5)*5,0)))))))))","v":0.38},{"$f":"SUM(J21,L21,N21,P21,R21,T21)","v":0.5}]
[{"$f":"IF(B22=\"\",\"\",A21+1)","v":3},{"$f":"IF('1ERPA'!F19=\"\",\"\",'1ERPA'!F19)","v":"LA MADRID GONZALEZ FERNANDA ISABEL "},"Estratégico","Receptivo",null,null,null,null,6,0.33333333333333331,null,"",null,"",null,"",null,{"$f":"IF(Q22=\"\",\"\",($R$19/$Q$19)*Q22)","v":""},null,{"$f":"IF(S22=\"\",\"\",($T$19/$S$19)*S22)","v":""},null,null,0.77333333333333321,0.38,0.33333333333333331]
[{"$f":"IF(B23=\"\",\"\",A22+1)","v":4},{"$f":"IF('1ERPA'!F20=\"\",\"\",'1ERPA'!F20)","v":"LOPEZ CASTRO GLORIA KARINA"},"Estratégico","Receptivo",null,null,null,null,9,{"$f":"IF(I23=\"\",\"\",($J$19/$I$19)*I23)","v":0.5},null,{"$f":"IF(K23=\"\",\"\",($L$19/$K$19)*K23)","v":""},null,"",null,"",null,"",null,{"$f":"IF(S23=\"\",\"\",($T$19/$S$19)*S23)","v":""},null,null,0.94]
[5,{"$f":"IF('1ERPA'!F21=\"\",\"\",'1ERPA'!F21)","v":"GUZMAN SANTOS ALAN"},"Estratégico","Receptivo",null,null,null,null,9,0.5,null,"",null,"",null,"",null,"",null,"",null,null,0.94,0.38,0.5]
[6,{"$f":"IF('1ERPA'!F22=\"\",\"\",'1ERPA'!F22)","v":"Y"},"Estratégico","Receptivo",null,null,null,null,9,0.5,null,"",null,"",null,"",null,{"$f":"IF(Q25=\"\",\"\",($R$19/$Q$19)*Q25)","v":""},null,{"$f":"IF(S25=\"\",\"\",($T$19/$S$19)*S25)","v":""},null,null,0.94,0.38,0.5]
[7,{"$f":"IF('1ERPA'!F23=\"\",\"\",'1ERPA'!F23)","v":"U"},"Estratégico","Receptivo",null,null,null,null,9,0.5,null,"",null,{"$f":"IF(M26=\"\",\"\",($N$19/$M$19)*M26)","v":""},null,{"$f":"IF(O26=\"\",\"\",($P$19/$O$19)*O26)","v":""},null,{"$f":"IF(Q26=\"\",\"\",($R$19/$Q$19)*Q26)","v":""},null,"",null,null,0.94,0.38,0.5]
[8,{"$f":"IF('1ERPA'!F24=\"\",\"\",'1ERPA'!F24)","v":"ILLAN MONJARDIN JOSE LUIS"},"Estratégico","Receptivo",null,null,null,null,9,0.5,null,"",null,"",null,"",null,"",null,"",null,null,0.94,0.38,0.5]
[{"$f":"IF(B28=\"\",\"\",A27+1)","v":9},{"$f":"IF('1ERPA'!F25=\"\",\"\",'1ERPA'!F25)","v":"e"},"Estratégico","Receptivo",null,null,null,null,9,{"$f":"IF(I28=\"\",\"\",($J$19/$I$19)*I28)","v":0.5},null,{"$f":"IF(K28=\"\",\"\",($L$19/$K$19)*K28)","v":""},null,{"$f":"IF(M28=\"\",\"\",($N$19/$M$19)*M28)","v":""},null,{"$f":"IF(O28=\"\",\"\",($P$19/$O$19)*O28)","v":""},null,{"$f":"IF(Q28=\"\",\"\",($R$19/$Q$19)*Q28)","v":""},null,{"$f":"IF(S28=\"\",\"\",($T$19/$S$19)*S28)","v":""},null,null,{"$f":"IF(B28=\"\",\"\",(IF(B28=\"\",0,IF(C28=\"Sin Nivel\",($C$19)*0,IF(C28=\"Pre-Formal\",($C$19)*60%,IF(C28=\"Receptivo\",($C$19)*70%,IF(C28=\"Resolutivo\",($C$19)*80%,IF(C28=\"Autónomo\",($C$19)*90%,IF(C28=\"Estratégico\",($C$19)*100%,0)))))))+IF(D28=\"\",0,IF(D28=\"Sin Nivel\",($D$19)*0,IF(D28=\"Pre-Formal\",($D$19)*60%,IF(D28=\"Receptivo\",($D$19)*70%,IF(D28=\"Resolutivo\",($D$19)*80%,IF(D28=\"Autónomo\",($D$19)*90%,IF(D28=\"Estratégico\",($D$19)*100%,0)))))))+IF(E28=\"\",0,IF(E28=\"Sin Nivel\",($E$19)*0,IF(E28=\"Pre-Formal\",($E$19)*60%,IF(E28=\"Receptivo\",($E$19)*70%,IF(E28=\"Resolutivo\",($E$19)*80%,IF(E28=\"Autónomo\",($E$19)*90%,IF(E28=\"Estratégico\",($E$19)*100%,0)))))))+IF(F28=\"\",0,IF(F28=\"Sin Nivel\",($F$19)*0,IF(F28=\"Pre-Formal\",($F$19)*60%,IF(F28=\"Receptivo\",($F$19)*70%,IF(F28=\"Resolutivo\",($F$19)*80%,IF(F28=\"Autónomo\",($F$19)*90%,IF(F28=\"Estratégico\",($F$19)*100%,0)))))))+IF(G28=\"\",0,IF(G28=\"Sin Nivel\",($G$19)*0,IF(G28=\"Pre-Formal\",($G$19)*60%,IF(G28=\"Receptivo\",($G$19)*70%,IF(G28=\"Resolutivo\",($G$19)*80%,IF(G28=\"Autónomo\",($G$19)*90%,IF(G28=\"Estratégico\",($G$19)*100%,0)))))))+IF(H28=\"\",0,IF(H28=\"Sin Nivel\",($H$19)*0,IF(H28=\"Pre-Formal\",($H$19)*60%,IF(H28=\"Receptivo\",($H$19)*70%,IF(H28=\"Resolutivo\",($H$19)*80%,IF(H28=\"Autónomo\",($H$19)*90%,IF(H28=\"Estratégico\",($H$19)*100%,0))))))))+SUM(J28,L28,N28,P28,R28,T28))","v":0.94}]
[10,{"$f":"IF('1ERPA'!F26=\"\",\"\",'1ERPA'!F26)","v":"f"},"Estratégico","Receptivo",null,null,null,null,9,0.5,null,"",null,"",null,"",null,"",null,"",null,null,0.94]
[11,{"$f":"IF('1ERPA'!F27=\"\",\"\",'1ERPA'!F27)","v":"GUZMAN SANTOS ALAN"},"Estratégico","Receptivo",null,null,null,null,9,0.5,null,"",null,"",null,"",null,"",null,"",null,null,0.94]
[12,{"$f":"IF('1ERPA'!F28=\"\",\"\",'1ERPA'!F28)","v":"h"},"Estratégico","Receptivo",null,null,null,null,9,0.5,null,"",null,"",null,"",null,"",null,"",null,null,0.94]
[13,{"$f":"IF('1ERPA'!F29=\"\",\"\",'1ERPA'!F29)","v":"ILLAN MONJARDIN JOSE LUIS"},"Estratégico","Receptivo",null,null,null,null,9,0.5,null,"",null,"",null,"",null,"",null,"",null,null,0.94]
[14,{"$f":"IF('1ERPA'!F30=\"\",\"\",'1ERPA'!F30)","v":"T"},"Estratégico","Receptivo",null,null,null,null,9,0.5,null,"",null,"",null,"",null,"",null,"",null,null,0.94]
["",{"$f":"IF('1ERPA'!F31=\"\",\"\",'1ERPA'!F31)","v":""},"Estratégico","Receptivo",null,null,null,null,9,0.5,null,"",null,"",null,"",null,"",null,"",null,null,""]
["",{"$f":"IF('1ERPA'!F32=\"\",\"\",'1ERPA'!F32)","v":""},"Estratégico","Receptivo",null,null,null,null,9,0.5,null,"",null,"",null,"",null,"",null,"",null,null,""]
["",{"$f":"IF('1ERPA'!F33=\"\",\"\",'1ERPA'!F33)","v":""},"Estratégico","Receptivo",null,null,null,null,9,0.5,null,"",null,"",null,"",null,"",null,"",null,null,""]
["",{"$f":"IF('1ERPA'!F34=\"\",\"\",'1ERPA'!F34)","v":""},"Estratégico","Receptivo",null,null,null,null,9,0.5,null,"",null,"",null,"",null,"",null,"",null,null,""]
["",{"$f":"IF('1ERPA'!F35=\"\",\"\",'1ERPA'!F35)","v":""},"Estratégico","Receptivo",null,null,null,null,9,0.5,null,"",null,"",null,"",null,"",null,"",null,null,""]
["",{"$f":"IF('1ERPA'!F36=\"\",\"\",'1ERPA'!F36)","v":""},"Estratégico","Receptivo",null,null,null,null,9,0.5,null,"",null,"",null,"",null,"",null,"",null,null,""]
["",{"$f":"IF('1ERPA'!F37=\"\",\"\",'1ERPA'!F37)","v":""},"Estratégico","Receptivo",null,null,null,null,9,0.5,null,"",null,"",null,"",null,"",null,"",null,null,""]
["",{"$f":"IF('1ERPA'!F38=\"\",\"\",'1ERPA'!F38)","v":""},"Estratégico","Receptivo",null,null,null,null,9,0.5,null,"",null,"",null,"",null,"",null,"",null,null,""]
["",{"$f":"IF('1ERPA'!F39=\"\",\"\",'1ERPA'!F39)","v":""},"Estratégico","Receptivo",null,null,null,null,9,0.5,null,"",null,"",null,"",null,"",null,"",null,null,""]
["",{"$f":"IF('1ERPA'!F40=\"\",\"\",'1ERPA'!F40)","v":""},"Estratégico","Receptivo",null,null,null,null,9,0.5,null,"",null,"",null,"",null,"",null,"",null,null,""]
["",{"$f":"IF('1ERPA'!F41=\"\",\"\",'1ERPA'!F41)","v":""},"Estratégico","Receptivo",null,null,null,null,9,0.5,null,"",null,"",null,"",null,"",null,"",null,null,""]
["",{"$f":"IF('1ERPA'!F42=\"\",\"\",'1ERPA'!F42)","v":""},"Estratégico","Receptivo",null,null,null,null,9,0.5,null,"",null,"",null,"",null,"",null,"",null,null,""]
["",{"$f":"IF('1ERPA'!F43=\"\",\"\",'1ERPA'!F43)","v":""},"Estratégico","Receptivo",null,null,null,null,9,0.5,null,"",null,"",null,"",null,"",null,"",null,null,""]
["",{"$f":"IF('1ERPA'!F44=\"\",\"\",'1ERPA'!F44)","v":""},null,null,null,null,null,null,null,"",null,"",null,"",null,"",null,"",null,"",null,null,"","",0]
["",{"$f":"IF('1ERPA'!F45=\"\",\"\",'1ERPA'!F45)","v":""},null,null,null,null,null,null,null,"",null,"",null,"",null,"",null,"",null,"",null,null,"","",0]
["",{"$f":"IF('1ERPA'!F46=\"\",\"\",'1ERPA'!F46)","v":""},null,null,null,null,null,null,null,"",null,"",null,{"$f":"IF(M49=\"\",\"\",($N$19/$M$19)*M49)","v":""},null,{"$f":"IF(O49=\"\",\"\",($P$19/$O$19)*O49)","v":""},null,{"$f":"IF(Q49=\"\",\"\",($R$19/$Q$19)*Q49)","v":""},null,{"$f":"IF(S49=\"\",\"\",($T$19/$S$19)*S49)","v":""},null,null,"","",0]
["",{"$f":"IF('1ERPA'!F47=\"\",\"\",'1ERPA'!F47)","v":""},null,null,null,null,null,null,null,{"$f":"IF(I50=\"\",\"\",($J$19/$I$19)*I50)","v":""},null,{"$f":"IF(K50=\"\",\"\",($L$19/$K$19)*K50)","v":""},null,"",null,"",null,"",null,"",null,null,"","",0]
["",{"$f":"IF('1ERPA'!F48=\"\",\"\",'1ERPA'!F48)","v":""},null,null,null,null,null,null,null,{"$f":"IF(I51=\"\",\"\",($J$19/$I$19)*I51)","v":""},null,{"$f":"IF(K51=\"\",\"\",($L$19/$K$19)*K51)","v":""},null,{"$f":"IF(M51=\"\",\"\",($N$19/$M$19)*M51)","v":""},null,{"$f":"IF(O51=\"\",\"\",($P$19/$O$19)*O51)","v":""},null,"",null,"",null,null,"","",0]
["",{"$f":"IF('1ERPA'!F49=\"\",\"\",'1ERPA'!F49)","v":""},null,null,null,null,null,null,null,"",null,"",null,"",null,"",null,"",null,"",null,null,"","",0]
["",{"$f":"IF('1ERPA'!F50=\"\",\"\",'1ERPA'!F50)","v":""},null,null,null,null,null,null,null,"",null,"",null,"",null,"",null,"",null,"",null,null,"","",0]
["",{"$f":"IF('1ERPA'!F51=\"\",\"\",'1ERPA'!F51)","v":""},null,null,null,null,null,null,null,"",null,"",null,"",null,"",null,"",null,"",null,null,"","",0]
["",{"$f":"IF('1ERPA'!F52=\"\",\"\",'1ERPA'!F52)","v":""},null,null,null,null,null,null,null,"",null,"",null,"",null,"",null,"",null,"",null,null,"","",0]
["",{"$f":"IF('1ERPA'!F53=\"\",\"\",'1ERPA'!F53)","v":""},null,null,null,null,null,null,null,"",null,"",null,"",null,"",null,"",null,"",null,null,"","",0]
["",{"$f":"IF('1ERPA'!F54=\"\",\"\",'1ERPA'!F54)","v":""},null,null,null,null,null,null,null,"",null,"",null,"",null,"",null,"",null,"",null,null,"","",0]
["",{"$f":"IF('1ERPA'!F55=\"\",\"\",'1ERPA'!F55)","v":""},null,null,null,null,null,null,null,"",null,"",null,"",null,"",null,"",null,"",null,null,"","",0]
["",{"$f":"IF('1ERPA'!F56=\"\",\"\",'1ERPA'!F56)","v":""},null,null,null,null,null,null,null,"",null,"",null,"",null,"",null,"",null,"",null,null,"","",0]
["",{"$f":"IF('1ERPA'!F57=\"\",\"\",'1ERPA'!F57)","v":""},null,null,null,null,null,null,null,"",null,"",null,"",null,"",null,"",null,"",null,null,"","",0]
["",{"$f":"IF('1ERPA'!F58=\"\",\"\",'1ERPA'!F58)","v":""},null,null,null,null,null,null,null,"",null,"",null,"",null,"",null,"",null,"",null,null,"","",0]
["",{"$f":"IF('1ERPA'!F59=\"\",\"\",'1ERPA'!F59)","v":""},null,null,null,null,null,null,null,"",null,"",null,"",null,"",null,"",null,"",null,null,"","",0]
["",{"$f":"IF('1ERPA'!F60=\"\",\"\",'1ERPA'!F60)","v":""},null,null,null,null,null,null,null,"",null,"",null,"",null,"",null,"",null,"",null,null,"","",0]
["",{"$f":"IF('1ERPA'!F61=\"\",\"\",'1ERPA'!F61)","v":""},null,null,null,null,null,null,null,"",null,"",null,"",null,"",null,"",null,"",null,null,"","",0]
["",{"$f":"IF('1ERPA'!F62=\"\",\"\",'1ERPA'!F62)","v":""},null,null,null,null,null,null,null,"",null,"",null,"",null,"",null,"",null,"",null,null,"","",0]
["",{"$f":"IF('1ERPA'!F63=\"\",\"\",'1ERPA'!F63)","v":""},null,null,null,null,null,null,null,"",null,"",null,"",null,"",null,"",null,"",null,null,"","",0]
["",{"$f":"IF('1ERPA'!F64=\"\",\"\",'1ERPA'!F64)","v":""},null,null,null,null,null,null,null,"",null,"",null,"",null,"",null,"",null,"",null,null,"","",0]
["",{"$f":"IF('1ERPA'!F65=\"\",\"\",'1ERPA'!F65)","v":""},null,null,null,null,null,null,null,"",null,"",null,"",null,"",null,"",null,"",null,null,"","",0]
["",{"$f":"IF('1ERPA'!F66=\"\",\"\",'1ERPA'!F66)","v":""},null,null,null,null,null,null,null,"",null,"",null,"",null,"",null,"",null,"",null,null,"","",0]

{"sheet":"1ERPRE","index":2,"n_rows":47,"n_cols":39,"rows_kept":47,"cut":false,"hidden":false,"merged":[[39,1,39,40],[50,1,50,20],[50,21,50,40],[47,1,47,20],[47,21,47,40],[48,1,48,20],[48,21,48,40],[49,1,49,20],[49,21,49,40],[42,1,42,40],[43,1,43,40],[45,1,45,40],[46,1,46,20],[46,21,46,40],[41,1,41,40],[30,1,30,40],[31,1,31,20],[31,21,31,40],[40,1,40,40],[33,1,33,20],[33,21,33,40],[34,1,34,20],[34,21,34,40],[35,1,35,20],[35,21,35,40],[32,1,32,20],[32,21,32,40],[36,1,36,20],[36,21,36,40],[37,1,37,20],[37,21,37,40],[28,18,28,28],[21,4,21,6],[21,16,22,16],[21,17,22,17],[21,37,22,37],[22,4,22,6],[22,26,22,28],[22,34,22,36],[26,30,27,31],[26,32,27,32],[26,33,27,33],[26,34,27,36],[26,37,27,37],[17,2,19,8],[17,11,19,21],[17,24,19,30],[17,33,19,39],[26,38,27,39],[27,18,27,28],[21,38,22,38],[9,2,11,8],[9,11,11,21],[9,24,11,30],[9,33,11,39],[13,18,14,18],[13,19,14,19],[13,37,14,37],[13,38,14,38],[14,3,14,7],[14,13,14,17],[14,26,14,28],[14,34,14,36],[0,29,1,40],[2,31,2,40],[3,5,6,15],[5,26,5,27],[5,29,5,31],[5,34,5,39]]}
[null,null,null,null,null,null,null,null,null,null,null,null,null,null,null,null,null,null,null,null,null,null,null,null,null,null,null,null,null,{"$f":"IF('1ERPA'!M5=\"\",\"\",'1ERPA'!M5)","v":"Ingeniería en Sistemas Computacionales"}]
[]
[null,null,null,null,null,null,null,null,null,null,null,null,null,null,null,null,null,null,null,null,null,null,null,null,null,null,null,null,null,null,null,{"$f":"IF(MAX('1ERPA'!A17:A66)=0,\"\",MAX('1ERPA'!A17:A66))","v":14}]
[]
[]
[null,null,null,null,null,null,null,null,null,null,null,null,null,null,null,null,null,null,null,null,null,null,null,null,null,null,"1er.",null,null,{"$f":"'1ERPA'!K7","v":"QUINTO"},null,null,{"$f":"IF('1ERPA'!Q7=\"\",\"\",'1ERPA'!Q7)","v":"A"},null,{"$f":"IF('1ERPA'!AD5=\"\",\"\",'1ERPA'!AD5)","v":"SEGURIDAD INFORMÁTICA Y DE REDES"}]
[]
[]
[]
[null,null,"PROMEDIO MENSUAL ASISTENCIA",null,null,null,null,null,null,null,null,"SUSTITUCIÓN",null,null,null,null,null,null,null,null,null,null,null,null,"PORCENTAJE DE APROBACIÓN",null,null,null,null,null,null,null,null,"SUSTITUCÓN"]
[]
[]
[]
[null,null,null,"AR","*","CI","-","F",null,null,null,null,null,{"$f":"AF3","v":14},"*",{"$f":"'1ERPA'!AK15","v":16},"-",{"$f":"'1ERPA'!AL15","v":1},"=",{"$f":"IF(N15=0,0,((N14*P14)-R14)/N15)","v":13.9375},null,null,null,null,null,null,"AA","*",100,null,null,null,null,null,{"$f":"COUNTIF('1ERPA'!AO17:AO66,\">=6\")","v":14},"*",100,"=",{"$f":"IF(AI15=\"\",0,(AI14*AK14)/AI15)","v":100}]
[null,null,null,"CI",null,null,null,null,null,null,null,null,null,{"$f":"'1ERPA'!AK15:AK16","v":16},null,null,null,null,null,null,null,null,null,null,null,null,"AR",null,null,null,null,null,null,null,{"$f":"AF3","v":14}]
[]
[]
[null,null,"PROMEDIO DE EFICIENCIA",null,null,null,null,null,null,null,null,"SUSTITUCIÓN",null,null,null,null,null,null,null,null,null,null,null,null,"PORCENTAJE DE AVANCE PROGRAMÁTICO",null,null,null,null,null,null,null,null,"SUSTITUCÓN"]
[]
[]
[]
[null,null,null,null,"∑Cal",null,null,null,null,null,null,null,null,null,null,{"$f":"IF(P23=0,0,SUM('1ERPA'!AN17:AN66)/10)","v":129.93333333333334},"=",{"$f":"IF(P23=\"\",0,P22/P23)","v":9.2809523809523817},null,null,null,null,null,null,null,null,"TI","*",100,null,null,null,null,null,10,"*",{"$f":"AC22","v":100},"=",{"$f":"IF(AI23=\"\",0,(AI22*AK22)/AI23)","v":83.333333333333329}]
[null,null,null,null,"AR",null,null,null,null,null,null,null,null,null,null,{"$f":"AF3","v":14},null,null,null,null,null,null,null,null,null,null,"TP",null,null,null,null,null,null,null,12]
[]
[]
[null,null,"SIMBOLOGÍA",null,null,null,null,null,null,null,"CI:","Número de clases impartidas"]
[null,null,"AR:","Cantidad de alumnos regulares",null,null,null,null,null,null,"AA:","Cantidad de alumnos aprobados",null,null,null,null,null,null,null,null,null,null,null,null,null,null,null,null,null,null,"PUEBLA,",null,3,"DE","FEBRERO",null,null,"DE",2019]
[null,null,"F:","Faltas de alumnos en el periodo",null,null,null,null,null,null,"TI:","Temas impartidos",null,null,null,null,null,null,{"$f":"IF('1ERPA'!X10=\"\",\"\",'1ERPA'!X10)","v":"ALDO ORTEGA PACHECO"}]
[null,null,"Cal:","Calificaciones",null,null,null,null,null,null,"TP:","Temas programados",null,null,null,null,null,null,"NOMBRE Y FIRMA DEL CATEDRÁTICO",null,null,null,null,null,null,null,null,null,null,null,"SD/F"]
[]
[null,"ALUMNOS REPROBADOS Y CAUSA DE LA REPROBACIÓN"]
[null,"NOMBRE COMPLETO DEL ALUMNO",null,null,null,null,null,null,null,null,null,null,null,null,null,null,null,null,null,null,null,"CAUSA"]
[{"$f":"A32+1","v":1},{"$f":"IFERROR(VLOOKUP(A33,'1ERPA'!$E$17:$F$66,2,FALSE),\"\")","v":""},null,null,null,null,null,null,null,null,null,null,null,null,null,null,null,null,null,null,null,{"$f":"IF(B33=\"\",\"\",IF(IFERROR(VLOOKUP(B33,'1ERPA'!$F$17:$AO$66,36,FALSE),0)=$AE$29,\"SIN DERECHO POR FALTAS\",IF(VLOOKUP(B33,'1ERPM'!B20:Y69,22,FALSE)<0.3,IF(VLOOKUP(B33,'1ERPM'!B20:Y69,21,FALSE)<0.3,\"NO ENTREGO, LOS INDICADORES DE DESEMPEÑO Y EVIDENCIAS DE APRENDIZAJE NECESARIAS PARA APROBAR\",\"NO ENTREGO, LOS INDICADORES DE DESEMPEÑO NECESARIOS PARA APROBAR\"),\"NO ENTREGO, LAS EVIDENCIAS DE APRENDIZAJE NECESARIOS PARA APROBAR\")))","v":""}]
[2,{"$f":"IFERROR(VLOOKUP(A34,'1ERPA'!$E$17:$F$66,2,FALSE),\"\")","v":""},null,null,null,null,null,null,null,null,null,null,null,null,null,null,null,null,null,null,null,{"$f":"IF(B34=\"\",\"\",IF(IFERROR(VLOOKUP(B34,'1ERPA'!$F$17:$AO$66,36,FALSE),0)=$AE$29,\"SIN DERECHO POR FALTAS\",IF(VLOOKUP(B34,'1ERPM'!B21:Y70,22,FALSE)<0.3,IF(VLOOKUP(B34,'1ERPM'!B21:Y70,21,FALSE)<0.3,\"NO ENTREGO, LOS INDICADORES DE DESEMPEÑO Y EVIDENCIAS DE APRENDIZAJE NECESARIAS PARA APROBAR\",\"NO ENTREGO, LOS INDICADORES DE DESEMPEÑO NECESARIOS PARA APROBAR\"),\"NO ENTREGO, LAS EVIDENCIAS DE APRENDIZAJE NECESARIOS PARA APROBAR\")))","v":""}]
[3,{"$f":"IFERROR(VLOOKUP(A35,'1ERPA'!$E$17:$F$66,2,FALSE),\"\")","v":""},null,null,null,null,null,null,null,null,null,null,null,null,null,null,null,null,null,null,null,{"$f":"IF(B35=\"\",\"\",IF(IFERROR(VLOOKUP(B35,'1ERPA'!$F$17:$AO$66,36,FALSE),0)=$AE$29,\"SIN DERECHO POR FALTAS\",IF(VLOOKUP(B35,'1ERPM'!B22:Y71,22,FALSE)<0.3,IF(VLOOKUP(B35,'1ERPM'!B22:Y71,21,FALSE)<0.3,\"NO ENTREGO, LOS INDICADORES DE DESEMPEÑO Y EVIDENCIAS DE APRENDIZAJE NECESARIAS PARA APROBAR\",\"NO ENTREGO, LOS INDICADORES DE DESEMPEÑO NECESARIOS PARA APROBAR\"),\"NO ENTREGO, LAS EVIDENCIAS DE APRENDIZAJE NECESARIOS PARA APROBAR\")))","v":""}]
[4,{"$f":"IFERROR(VLOOKUP(A36,'1ERPA'!$E$17:$F$66,2,FALSE),\"\")","v":""},null,null,null,null,null,null,null,null,null,null,null,null,null,null,null,null,null,null,null,{"$f":"IF(B36=\"\",\"\",IF(IFERROR(VLOOKUP(B36,'1ERPA'!$F$17:$AO$66,36,FALSE),0)=$AE$29,\"SIN DERECHO POR FALTAS\",IF(VLOOKUP(B36,'1ERPM'!B24:Y72,22,FALSE)<0.3,IF(VLOOKUP(B36,'1ERPM'!B24:Y72,21,FALSE)<0.3,\"NO ENTREGO, LOS INDICADORES DE DESEMPEÑO Y EVIDENCIAS DE APRENDIZAJE NECESARIAS PARA APROBAR\",\"NO ENTREGO, LOS INDICADORES DE DESEMPEÑO NECESARIOS PARA APROBAR\"),\"NO ENTREGO, LAS EVIDENCIAS DE APRENDIZAJE NECESARIOS PARA APROBAR\")))","v":""}]
[5,{"$f":"IFERROR(VLOOKUP(A37,'1ERPA'!$E$17:$F$66,2,FALSE),\"\")","v":""},null,null,null,null,null,null,null,null,null,null,null,null,null,null,null,null,null,null,null,{"$f":"IF(B37=\"\",\"\",IF(IFERROR(VLOOKUP(B37,'1ERPA'!$F$17:$AO$66,36,FALSE),0)=$AE$29,\"SIN DERECHO POR FALTAS\",IF(VLOOKUP(B37,'1ERPM'!B25:Y73,22,FALSE)<0.3,IF(VLOOKUP(B37,'1ERPM'!B25:Y73,21,FALSE)<0.3,\"NO ENTREGO, LOS INDICADORES DE DESEMPEÑO Y EVIDENCIAS DE APRENDIZAJE NECESARIAS PARA APROBAR\",\"NO ENTREGO, LOS INDICADORES DE DESEMPEÑO NECESARIOS PARA APROBAR\"),\"NO ENTREGO, LAS EVIDENCIAS DE APRENDIZAJE NECESARIOS PARA APROBAR\")))","v":""}]
[6,{"$f":"IF('1ERPA'!E16>6,\"Y \"&'1ERPA'!E16-5&\" MÁS REPROBADOS\",IFERROR(VLOOKUP(A38,'1ERPA'!$E$17:$F$66,2,FALSE),\"\"))","v":""},null,null,null,null,null,null,null,null,null,null,null,null,null,null,null,null,null,null,null,{"$f":"IF(IFERROR(VLOOKUP(A38,'1ERPA'!$E$17:$F$66,2,FALSE),\"\")=B38,IF(B38=\"\",\"\",IF(IFERROR(VLOOKUP(B38,'1ERPA'!$F$17:$AO$66,36,FALSE),0)=$AE$29,\"SIN DERECHO POR FALTAS\",IF(VLOOKUP(B38,'1ERPM'!B26:Y74,22,FALSE)<0.3,IF(VLOOKUP(B38,'1ERPM'!B26:Y74,21,FALSE)<0.3,\"NO ENTREGO, LOS INDICADORES DE DESEMPEÑO Y EVIDENCIAS DE APRENDIZAJE NECESARIAS PARA APROBAR\",\"NO ENTREGO, LOS INDICADORES DE DESEMPEÑO NECESARIOS PARA APROBAR\"),\"NO ENTREGO, LAS EVIDENCIAS DE APRENDIZAJE NECESARIOS PARA APROBAR\"))),\"SIN DERECHO POR FALTAS Y/O POR NO ENTREGAR LAS EVIDENCIAS NECESARIAS\")","v":""}]
[null,null,null,null,null,null,null,null,null,null,null,null,null,null,null,null,null,null,null,null,null,null,null,null,null,null,null,null,{"$f":"IF('1ERPA'!$C$16<>0,\"CONTACTAR A LOS ALUMNOS PARA SABER QUE SUCEDE\",IF('1ERPA'!$D$16<>0,\"ASESORIAS PARA QUE MEJORE SU CALIFICACIÓN\",\"\"))","v":""}]
[null,"PROPUESTA DE SOLUCIÓN PARA REDUCIR EL PORCENTAJE DE REPROBACIÓN"]
[null,{"$f":"IF(AND('1ERPA'!C16>0,'1ERPA'!D16=0),\"CONTACTAR A LOS ALUMNOS PARA SABER QUE SUCEDE CON SUS ASISTENCIAS\",IF(AND('1ERPA'!C16=0,'1ERPA'!D16>0),\"ASESORIAS PARA QUE MEJOREN SUS CALIFICACIONES\",IF(AND('1ERPA'!C16>0,'1ERPA'!D16>0),\"ASESORIAS PARA QUE MEJOREN SUS CALIFICACIONES Y CONTACTAR A LOS ALUMNOS PARA SABER QUE SUCEDE CON SUS ASISTENCIAS\",\"\")))","v":""}]
[]
[]
[]
[]
[null,"TEMAS PENDIENTES DEL PERIODO QUE SE REPORTAN"]
[null,"TEMA(S)",null,null,null,null,null,null,null,null,null,null,null,null,null,null,null,null,null,null,null,"MOTIVO(S)"]

{"sheet":"2DOPA","index":3,"n_rows":66,"n_cols":49,"rows_kept":66,"cut":false,"hidden":false,"merged":[[8,43,9,45],[8,46,15,46],[8,47,15,47],[8,48,15,48],[9,23,9,34],[10,23,10,34],[10,45,15,45],[11,6,11,35],[14,36,15,36],[10,43,15,43],[10,44,15,44],[14,39,15,39],[14,40,15,40],[14,42,15,42],[8,0,15,0],[8,5,15,5],[8,36,13,36],[8,37,13,37],[8,38,13,38],[14,37,15,37],[14,38,15,38],[6,10,6,12],[8,39,8,42],[9,39,13,40],[9,41,15,41],[9,42,13,42],[12,6,12,19],[12,20,12,21],[12,22,12,35],[0,0,0,48],[2,0,2,48],[4,12,4,23],[4,29,4,34],[1,20,1,24],[1,25,1,27]]}
["CONTROL DE ASISTENCIA Y EVALUACIONES"]
[null,null,null,null,null,null,null,null,null,null,null,null,null,null,null,null,null,null,null,null,"CICLO ESCOLAR ",null,null,null,null,{"$f":"IF('1ERPA'!W2=\"\",\"\",'1ERPA'!W2)","v":"2018-2019"}]
["SEGUNDO PARCIAL"]
[]
[null,null,null,null,null,null,null,null,null,null,null,"LICENCIATURA EN: ",{"$f":"IF('1ERPA'!M5=\"\",\"\",'1ERPA'!M5)","v":"Ingeniería en Sistemas Computacionales"},null,null,null,null,null,null,null,null,null,null,null,null,null,null,null,"ASIGNATURA: ",{"$f":"IF('1ERPA'!AD5=\"\",\"\",'1ERPA'!AD5)","v":"SEGURIDAD INFORMÁTICA Y DE REDES"}]
[]
[null,null,null,null,null,null,null,null,null,{"$f":"'1ERPA'!J7","v":"CUATRIMESTRE:"},{"$f":"IF('1ERPA'!K7=\"\",\"\",'1ERPA'!K7)","v":"QUINTO"},null,null,null,null,"GRUPO:",{"$f":"IF('1ERPA'!Q7=\"\",\"\",'1ERPA'!Q7)","v":"A"},null,null,null,"PERIODO: ",{"$f":"IF('1ERPA'!V7=\"\",\"\",'1ERPA'!V7)","v":"A"}]
[]
["No.",null,null,null,null,"NOMBRE DEL ALUMNO",null,"SIMBOLOGIA:",null,null,null,"A:","ASISTENCIA",null,null,null,null,null,null,null,null,null,null,null,null,null,null,null,null,null,null,null,null,null,null,null,"CLASES IMPARTIDAS","TOTAL FALTAS","% ASISTENCIA","EVALUACIÓN",null,null,null,"PRIMER PARCIAL",null,null,"PROMEDIO % ASISTENCIA","PROMEDIO DE CALIFICACIONES","SUMA DEL % PARCIALES"]
[null,null,null,null,null,null,null,null,null,null,null,"F:","FALTA",null,null,null,null,null,null,null,null,null,null,{"$f":"IF('1ERPA'!X10=\"\",\"\",'1ERPA'!X10)","v":"ALDO ORTEGA PACHECO"},null,null,null,null,null,null,null,null,null,null,null,null,null,null,null,"CALIFICACIÓN",null,"CALIF. CON LETRA","% PARCIAL"]
[null,null,null,null,null,null,null,null,null,null,null,"J:","JUSTIFICACIÓN",null,null,null,null,null,null,null,null,null,null,"NOMBRE Y FIRMA DEL CATEDRÁTICO",null,null,null,null,null,null,null,null,null,null,null,null,null,null,null,null,null,null,null,"% ASISTENCIA","CALIFICACIÓN","% PARCIAL"]
[null,null,null,null,null,null,"SEGUNDO PARCIAL"]
[null,null,null,null,null,null,"MARZO",null,null,null,null,null,null,null,null,null,null,null,null,null,"-",null,"ABRIL"]
[null,null,null,null,null,null,"Vi","Lu","Vi","Lu","Vi","Lu","Vi","Lu","Vi","Lu"]
[null,null,null,null,null,null,28,1,{"$f":"H15+4","v":5},{"$f":"I15+3","v":8},{"$f":"J15+4","v":12},{"$f":"K15+3","v":15},{"$f":"L15+4","v":19},{"$f":"M15+3","v":22},{"$f":"N15+4","v":26},{"$f":"O15+3","v":29},null,null,null,null,null,null,null,null,null,null,null,null,null,null,null,null,null,null,null,null,{"$f":"COUNT(G15:AJ15)","v":10},{"$f":"SUM(AL17:AL24)","v":1},{"$f":"100/AK15","v":10},"%","T",null,25]
[null,null,{"$f":"COUNTIF(C17:C66,\"=1\")","v":0},{"$f":"COUNTIF(D17:D66,\"=1\")","v":0},{"$f":"C16+D16","v":0},null,2,1,2,1,2,1,2,1,2,1]
[{"$f":"IF(F17=\"\",\"\",1)","v":1},{"$f":"AO17","v":10},{"$f":"IF(B17=\"SD/F\",1,0)","v":0},{"$f":"IF(B17<6,1,0)","v":0},{"$f":"IF(B17=\"SD/F\",1,IF(B17<6,1,0))","v":0},{"$f":"IF('1ERPA'!F17=\"\",\"\",'1ERPA'!F17)","v":"GUZMAN SANTOS ALAN"},"A","A","A","A","A","A","A","A","A","A",null,null,null,null,null,null,null,null,null,null,null,null,null,null,null,null,null,null,null,null,{"$f":"IF(G17=\"\",\"\",COUNTIF(G17:AJ17,\"A\")+COUNTIF(G17:AJ17,\"J\"))","v":10},{"$f":"IF(AK17=\"\",\"\",COUNTIF(G17:AJ17,\"F\"))","v":0},{"$f":"IF(AK17=\"\",\"\",($AK$15-AL17)*$AM$15)","v":100},{"$f":"IF('2DOPM'!W20=\"\",\"\",IF('2DOPM'!W20=0,\"\",('2DOPM'!W20)*100))","v":100},{"$f":"IF(AM17<80,\"SD/F\",IF(AN17=\"\",\"\",IF(AN17>=96,10,IF(AN17>=86,9,IF(AN17>=76,8,IF(AN17>=66,7,IF(AN17>=56,6,IF(AN17>=46,5,IF(AN17>=36,4,IF(AN17>=26,3,IF(AN17>=16,2,IF(AN17>=6,1,IF(AN17>=0,0,\"\")))))))))))))","v":10},{"$f":"IF(AM17<80,\"SD/F\",IF(AO17=\"\",\"\",IF(AO17>=9.6,\"DIEZ\",IF(AO17>=8.6,\"NUEVE\",IF(AO17>=7.6,\"OCHO\",IF(AO17>=6.6,\"SIETE\",IF(AO17>=5.6,\"SEIS\",IF(AO17>=4.6,\"CINCO\",IF(AO17>=3.6,\"CUATRO\",IF(AO17>=2.6,\"TRES\",IF(AO17>=1.6,\"DOS\",IF(AO17>=0.6,\"UNO\",IF(AO17>=0,\"CERO\",\"\")))))))))))))","v":"DIEZ"},{"$f":"IF(AP17=\"\",\"\",IF(AP17=\"SD/F\",0,($AQ$15/10)*AO17))","v":25},{"$f":"'1ERPA'!AM17","v":100},{"$f":"'1ERPA'!AO17","v":9},{"$f":"'1ERPA'!AQ17","v":22.5},{"$f":"IF(AM17=\"\",\"\",AVERAGE(AM17,AR17))","v":100},{"$f":"IF(AO17=\"\",\"\",AVERAGE(AO17,AS17))","v":9.5},{"$f":"IF(AQ17=\"\",\"\",SUM(AQ17,AT17))","v":47.5}]
[{"$f":"IF(F18=\"\",\"\",A17+1)","v":2},10,{"$f":"IF(B18=\"SD/F\",1,0)","v":0},{"$f":"IF(B18<6,1,0)","v":0},{"$f":"IF(B18=\"SD/F\",E17+1,IF(B18<6,E17+1,E17))","v":0},{"$f":"IF('1ERPA'!F18=\"\",\"\",'1ERPA'!F18)","v":"ILLAN MONJARDIN JOSE LUIS"},"A","A","A","A","A","A","A","A","A","A",null,null,null,null,null,null,null,null,null,null,null,null,null,null,null,null,null,null,null,null,{"$f":"IF(G18=\"\",\"\",COUNTIF(G18:AJ18,\"A\")+COUNTIF(G18:AJ18,\"J\"))","v":10},{"$f":"IF(AK18=\"\",\"\",COUNTIF(G18:AJ18,\"F\"))","v":0},{"$f":"IF(AK18=\"\",\"\",($AK$15-AL18)*$AM$15)","v":100},{"$f":"IF('2DOPM'!W21=\"\",\"\",IF('2DOPM'!W21=0,\"\",('2DOPM'!W21)*100))","v":100},{"$f":"IF(AM18<80,\"SD/F\",IF(AN18=\"\",\"\",IF(AN18>=96,10,IF(AN18>=86,9,IF(AN18>=76,8,IF(AN18>=66,7,IF(AN18>=56,6,IF(AN18>=46,5,IF(AN18>=36,4,IF(AN18>=26,3,IF(AN18>=16,2,IF(AN18>=6,1,IF(AN18>=0,0,\"\")))))))))))))","v":10},{"$f":"IF(AM18<80,\"SD/F\",IF(AO18=\"\",\"\",IF(AO18>=9.6,\"DIEZ\",IF(AO18>=8.6,\"NUEVE\",IF(AO18>=7.6,\"OCHO\",IF(AO18>=6.6,\"SIETE\",IF(AO18>=5.6,\"SEIS\",IF(AO18>=4.6,\"CINCO\",IF(AO18>=3.6,\"CUATRO\",IF(AO18>=2.6,\"TRES\",IF(AO18>=1.6,\"DOS\",IF(AO18>=0.6,\"UNO\",IF(AO18>=0,\"CERO\",\"\")))))))))))))","v":"DIEZ"},{"$f":"IF(AP18=\"\",\"\",IF(AP18=\"SD/F\",0,($AQ$15/10)*AO18))","v":25},{"$f":"'1ERPA'!AM18","v":100},{"$f":"'1ERPA'!AO18","v":9},{"$f":"'1ERPA'!AQ18","v":22.5},{"$f":"IF(AM18=\"\",\"\",AVERAGE(AM18,AR18))","v":100},{"$f":"IF(AO18=\"\",\"\",AVERAGE(AO18,AS18))","v":9.5},{"$f":"IF(AQ18=\"\",\"\",SUM(AQ18,AT18))","v":47.5}]
[{"$f":"IF(F19=\"\",\"\",A18+1)","v":3},7,0,0,{"$f":"IF(B19=\"SD/F\",E18+1,IF(B19<6,E18+1,E18))","v":0},{"$f":"IF('1ERPA'!F19=\"\",\"\",'1ERPA'!F19)","v":"LA MADRID GONZALEZ FERNANDA ISABEL "},"A","A","A","A","A","A","F","A","A","A",null,null,null,null,null,null,null,null,null,null,null,null,null,null,null,null,null,null,null,null,9,1,90,{"$f":"IF('2DOPM'!W22=\"\",\"\",IF('2DOPM'!W22=0,\"\",('2DOPM'!W22)*100))","v":73.888888888888886},7,"SIETE",17.5,{"$f":"'1ERPA'!AM19","v":100},{"$f":"'1ERPA'!AO19","v":8},{"$f":"'1ERPA'!AQ19","v":20},95,7.5,37.5]
[{"$f":"IF(F20=\"\",\"\",A19+1)","v":4},{"$f":"AO20","v":10},{"$f":"IF(B20=\"SD/F\",1,0)","v":0},{"$f":"IF(B20<6,1,0)","v":0},{"$f":"IF(B20=\"SD/F\",E19+1,IF(B20<6,E19+1,E19))","v":0},{"$f":"IF('1ERPA'!F20=\"\",\"\",'1ERPA'!F20)","v":"LOPEZ CASTRO GLORIA KARINA"},"A","A","A","A","A","A","A","A","A","A",null,null,null,null,null,null,null,null,null,null,null,null,null,null,null,null,null,null,null,null,10,0,100,{"$f":"IF('2DOPM'!W23=\"\",\"\",IF('2DOPM'!W23=0,\"\",('2DOPM'!W23)*100))","v":100},10,"DIEZ",25,{"$f":"'1ERPA'!AM20","v":100},{"$f":"'1ERPA'!AO20","v":9},{"$f":"'1ERPA'!AQ20","v":22.5},100,9.5,47.5]
[{"$f":"IF(F21=\"\",\"\",A20+1)","v":5},{"$f":"AO21","v":10},{"$f":"IF(B21=\"SD/F\",1,0)","v":0},{"$f":"IF(B21<6,1,0)","v":0},{"$f":"IF(B21=\"SD/F\",E20+1,IF(B21<6,E20+1,E20))","v":0},{"$f":"IF('1ERPA'!F21=\"\",\"\",'1ERPA'!F21)","v":"GUZMAN SANTOS ALAN"},"A","A","A","A","A","A","A","A","A","A",null,null,null,null,null,null,null,null,null,null,null,null,null,null,null,null,null,null,null,null,{"$f":"IF(G21=\"\",\"\",COUNTIF(G21:AJ21,\"A\")+COUNTIF(G21:AJ21,\"J\"))","v":10},{"$f":"IF(AK21=\"\",\"\",COUNTIF(G21:AJ21,\"F\"))","v":0},{"$f":"IF(AK21=\"\",\"\",($AK$15-AL21)*$AM$15)","v":100},{"$f":"IF('2DOPM'!W24=\"\",\"\",IF('2DOPM'!W24=0,\"\",('2DOPM'!W24)*100))","v":105.55555555555556},{"$f":"IF(AM21<80,\"SD/F\",IF(AN21=\"\",\"\",IF(AN21>=96,10,IF(AN21>=86,9,IF(AN21>=76,8,IF(AN21>=66,7,IF(AN21>=56,6,IF(AN21>=46,5,IF(AN21>=36,4,IF(AN21>=26,3,IF(AN21>=16,2,IF(AN21>=6,1,IF(AN21>=0,0,\"\")))))))))))))","v":10},{"$f":"IF(AM21<80,\"SD/F\",IF(AO21=\"\",\"\",IF(AO21>=9.6,\"DIEZ\",IF(AO21>=8.6,\"NUEVE\",IF(AO21>=7.6,\"OCHO\",IF(AO21>=6.6,\"SIETE\",IF(AO21>=5.6,\"SEIS\",IF(AO21>=4.6,\"CINCO\",IF(AO21>=3.6,\"CUATRO\",IF(AO21>=2.6,\"TRES\",IF(AO21>=1.6,\"DOS\",IF(AO21>=0.6,\"UNO\",IF(AO21>=0,\"CERO\",\"\")))))))))))))","v":"DIEZ"},{"$f":"IF(AP21=\"\",\"\",IF(AP21=\"SD/F\",0,($AQ$15/10)*AO21))","v":25},{"$f":"'1ERPA'!AM21","v":100},{"$f":"'1ERPA'!AO21","v":9},{"$f":"'1ERPA'!AQ21","v":22.5},{"$f":"IF(AM21=\"\",\"\",AVERAGE(AM21,AR21))","v":100},{"$f":"IF(AO21=\"\",\"\",AVERAGE(AO21,AS21))","v":9.5},{"$f":"IF(AQ21=\"\",\"\",SUM(AQ21,AT21))","v":47.5}]
[6,10,0,0,0,{"$f":"IF('1ERPA'!F22=\"\",\"\",'1ERPA'!F22)","v":"Y"},"A","A","A","A","A","A","A","A","A","A",null,null,null,null,null,null,null,null,null,null,null,null,null,null,null,null,null,null,null,null,10,0,100,{"$f":"IF('2DOPM'!W25=\"\",\"\",IF('2DOPM'!W25=0,\"\",('2DOPM'!W25)*100))","v":111.11111111111111},10,"DIEZ",25,{"$f":"'1ERPA'!AM22","v":100},{"$f":"'1ERPA'!AO22","v":9},{"$f":"'1ERPA'!AQ22","v":22.5},100,9.5,47.5]
[7,10,0,0,0,{"$f":"IF('1ERPA'!F23=\"\",\"\",'1ERPA'!F23)","v":"U"},"A","A","A","A","A","A","A","A","A","A",null,null,null,null,null,null,null,null,null,null,null,null,null,null,null,null,null,null,null,null,10,0,100,{"$f":"IF('2DOPM'!W26=\"\",\"\",IF('2DOPM'!W26=0,\"\",('2DOPM'!W26)*100))","v":116.66666666666666},10,"DIEZ",25,{"$f":"'1ERPA'!AM23","v":100},{"$f":"'1ERPA'!AO23","v":9},{"$f":"'1ERPA'!AQ23","v":22.5},100,9.5,47.5]
[8,10,0,0,0,{"$f":"IF('1ERPA'!F24=\"\",\"\",'1ERPA'!F24)","v":"ILLAN MONJARDIN JOSE LUIS"},"A","A","A","A","A","A","A","A","A","A",null,null,null,null,null,null,null,null,null,null,null,null,null,null,null,null,null,null,null,null,10,0,100,{"$f":"IF('2DOPM'!W27=\"\",\"\",IF('2DOPM'!W27=0,\"\",('2DOPM'!W27)*100))","v":122.22222222222223},10,"DIEZ",25,{"$f":"'1ERPA'!AM24","v":93.75},{"$f":"'1ERPA'!AO24","v":9},{"$f":"'1ERPA'!AQ24","v":22.5},96.875,9.5,47.5]
[{"$f":"IF(F25=\"\",\"\",A24+1)","v":9},{"$f":"AO25","v":10},{"$f":"IF(B25=\"SD/F\",1,0)","v":0},{"$f":"IF(B25<6,1,0)","v":0},{"$f":"IF(B25=\"SD/F\",E24+1,IF(B25<6,E24+1,E24))","v":0},{"$f":"IF('1ERPA'!F25=\"\",\"\",'1ERPA'!F25)","v":"e"},"A","A","A","A","A","A","A","A","A","A",null,null,null,null,null,null,null,null,null,null,null,null,null,null,null,null,null,null,null,null,10,0,100,{"$f":"IF('2DOPM'!W28=\"\",\"\",IF('2DOPM'!W28=0,\"\",('2DOPM'!W28)*100))","v":127.77777777777777},10,"DIEZ",25,{"$f":"'1ERPA'!AM25","v":93.75},{"$f":"'1ERPA'!AO25","v":9},{"$f":"'1ERPA'!AQ25","v":22.5},96.875,9.5,47.5]
[10,10,0,0,0,{"$f":"IF('1ERPA'!F26=\"\",\"\",'1ERPA'!F26)","v":"f"},"A","A","A","A","A","A","A","A","A","A",null,null,null,null,null,null,null,null,null,null,null,null,null,null,null,null,null,null,null,null,10,0,100,{"$f":"IF('2DOPM'!W29=\"\",\"\",IF('2DOPM'!W29=0,\"\",('2DOPM'!W29)*100))","v":133.33333333333331},10,"DIEZ",25,{"$f":"'1ERPA'!AM26","v":93.75},{"$f":"'1ERPA'!AO26","v":9},{"$f":"'1ERPA'!AQ26","v":22.5},96.875,9.5,47.5]
[11,10,0,0,0,{"$f":"IF('1ERPA'!F27=\"\",\"\",'1ERPA'!F27)","v":"GUZMAN SANTOS ALAN"},"A","A","A","A","A","A","A","A","A","A",null,null,null,null,null,null,null,null,null,null,null,null,null,null,null,null,null,null,null,null,10,0,100,{"$f":"IF('2DOPM'!W30=\"\",\"\",IF('2DOPM'!W30=0,\"\",('2DOPM'!W30)*100))","v":138.88888888888889},10,"DIEZ",25,{"$f":"'1ERPA'!AM27","v":93.75},{"$f":"'1ERPA'!AO27","v":9},{"$f":"'1ERPA'!AQ27","v":22.5},96.875,9.5,47.5]
[12,10,0,0,0,{"$f":"IF('1ERPA'!F28=\"\",\"\",'1ERPA'!F28)","v":"h"},"A","A","A","A","A","A","A","A","A","A",null,null,null,null,null,null,null,null,null,null,null,null,null,null,null,null,null,null,null,null,10,0,100,{"$f":"IF('2DOPM'!W31=\"\",\"\",IF('2DOPM'!W31=0,\"\",('2DOPM'!W31)*100))","v":144.44444444444443},10,"DIEZ",25,{"$f":"'1ERPA'!AM28","v":93.75},{"$f":"'1ERPA'!AO28","v":9},{"$f":"'1ERPA'!AQ28","v":22.5},96.875,9.5,47.5]
[13,10,0,0,0,{"$f":"IF('1ERPA'!F29=\"\",\"\",'1ERPA'!F29)","v":"ILLAN MONJARDIN JOSE LUIS"},"A","A","A","A","A","A","A","A","A","A",null,null,null,null,null,null,null,null,null,null,null,null,null,null,null,null,null,null,null,null,10,0,100,{"$f":"IF('2DOPM'!W32=\"\",\"\",IF('2DOPM'!W32=0,\"\",('2DOPM'!W32)*100))","v":150},10,"DIEZ",25,{"$f":"'1ERPA'!AM29","v":81.25},{"$f":"'1ERPA'!AO29","v":9},{"$f":"'1ERPA'!AQ29","v":22.5},90.625,9.5,47.5]
[14,10,0,0,0,{"$f":"IF('1ERPA'!F30=\"\",\"\",'1ERPA'!F30)","v":"T"},null,null,null,null,null,null,null,null,null,null,null,null,null,null,null,null,null,null,null,null,null,null,null,null,null,null,null,null,null,null,"","","",{"$f":"IF('2DOPM'!W33=\"\",\"\",IF('2DOPM'!W33=0,\"\",('2DOPM'!W33)*100))","v":155.55555555555557},10,"DIEZ",25,{"$f":"'1ERPA'!AM30","v":100},{"$f":"'1ERPA'!AO30","v":9},{"$f":"'1ERPA'!AQ30","v":22.5},"",9.5,47.5]
["","",0,0,0,{"$f":"IF('1ERPA'!F31=\"\",\"\",'1ERPA'!F31)","v":""},null,null,null,null,null,null,null,null,null,null,null,null,null,null,null,null,null,null,null,null,null,null,null,null,null,null,null,null,null,null,"","","",{"$f":"IF('2DOPM'!W34=\"\",\"\",IF('2DOPM'!W34=0,\"\",('2DOPM'!W34)*100))","v":""},"","","",{"$f":"'1ERPA'!AM31","v":""},{"$f":"'1ERPA'!AO31","v":""},{"$f":"'1ERPA'!AQ31","v":""},"","",""]
["","",0,0,0,{"$f":"IF('1ERPA'!F32=\"\",\"\",'1ERPA'!F32)","v":""},null,null,null,null,null,null,null,null,null,null,null,null,null,null,null,null,null,null,null,null,null,null,null,null,null,null,null,null,null,null,"","","",{"$f":"IF('2DOPM'!W35=\"\",\"\",IF('2DOPM'!W35=0,\"\",('2DOPM'!W35)*100))","v":""},"","","",{"$f":"'1ERPA'!AM32","v":""},{"$f":"'1ERPA'!AO32","v":""},{"$f":"'1ERPA'!AQ32","v":""},"","",""]
["","",0,0,0,{"$f":"IF('1ERPA'!F33=\"\",\"\",'1ERPA'!F33)","v":""},null,null,null,null,null,null,null,null,null,null,null,null,null,null,null,null,null,null,null,null,null,null,null,null,null,null,null,null,null,null,"","","",{"$f":"IF('2DOPM'!W36=\"\",\"\",IF('2DOPM'!W36=0,\"\",('2DOPM'!W36)*100))","v":""},"","","",{"$f":"'1ERPA'!AM33","v":""},{"$f":"'1ERPA'!AO33","v":""},{"$f":"'1ERPA'!AQ33","v":""},"","",""]
["","",0,0,0,{"$f":"IF('1ERPA'!F34=\"\",\"\",'1ERPA'!F34)","v":""},null,null,null,null,null,null,null,null,null,null,null,null,null,null,null,null,null,null,null,null,null,null,null,null,null,null,null,null,null,null,"","","",{"$f":"IF('2DOPM'!W37=\"\",\"\",IF('2DOPM'!W37=0,\"\",('2DOPM'!W37)*100))","v":""},"","","",{"$f":"'1ERPA'!AM34","v":""},{"$f":"'1ERPA'!AO34","v":""},{"$f":"'1ERPA'!AQ34","v":""},"","",""]
["","",0,0,0,{"$f":"IF('1ERPA'!F35=\"\",\"\",'1ERPA'!F35)","v":""},null,null,null,null,null,null,null,null,null,null,null,null,null,null,null,null,null,null,null,null,null,null,null,null,null,null,null,null,null,null,"","","",{"$f":"IF('2DOPM'!W38=\"\",\"\",IF('2DOPM'!W38=0,\"\",('2DOPM'!W38)*100))","v":""},"","","",{"$f":"'1ERPA'!AM35","v":""},{"$f":"'1ERPA'!AO35","v":""},{"$f":"'1ERPA'!AQ35","v":""},"","",""]
["","",0,0,0,{"$f":"IF('1ERPA'!F36=\"\",\"\",'1ERPA'!F36)","v":""},null,null,null,null,null,null,null,null,null,null,null,null,null,null,null,null,null,null,null,null,null,null,null,null,null,null,null,null,null,null,"","","",{"$f":"IF('2DOPM'!W39=\"\",\"\",IF('2DOPM'!W39=0,\"\",('2DOPM'!W39)*100))","v":""},"","","",{"$f":"'1ERPA'!AM36","v":""},{"$f":"'1ERPA'!AO36","v":""},{"$f":"'1ERPA'!AQ36","v":""},"","",""]
["","",0,0,0,{"$f":"IF('1ERPA'!F37=\"\",\"\",'1ERPA'!F37)","v":""},null,null,null,null,null,null,null,null,null,null,null,null,null,null,null,null,null,null,null,null,null,null,null,null,null,null,null,null,null,null,"","","",{"$f":"IF('2DOPM'!W40=\"\",\"\",IF('2DOPM'!W40=0,\"\",('2DOPM'!W40)*100))","v":""},"","","",{"$f":"'1ERPA'!AM37","v":""},{"$f":"'1ERPA'!AO37","v":""},{"$f":"'1ERPA'!AQ37","v":""},"","",""]
["","",0,0,0,{"$f":"IF('1ERPA'!F38=\"\",\"\",'1ERPA'!F38)","v":""},null,null,null,null,null,null,null,null,null,null,null,null,null,null,null,null,null,null,null,null,null,null,null,null,null,null,null,null,null,null,"","","",{"$f":"IF('2DOPM'!W41=\"\",\"\",IF('2DOPM'!W41=0,\"\",('2DOPM'!W41)*100))","v":""},"","","",{"$f":"'1ERPA'!AM38","v":""},{"$f":"'1ERPA'!AO38","v":""},{"$f":"'1ERPA'!AQ38","v":""},"","",""]
["","",0,0,0,{"$f":"IF('1ERPA'!F39=\"\",\"\",'1ERPA'!F39)","v":""},null,null,null,null,null,null,null,null,null,null,null,null,null,null,null,null,null,null,null,null,null,null,null,null,null,null,null,null,null,null,"","","",{"$f":"IF('2DOPM'!W42=\"\",\"\",IF('2DOPM'!W42=0,\"\",('2DOPM'!W42)*100))","v":""},"","","",{"$f":"'1ERPA'!AM39","v":""},{"$f":"'1ERPA'!AO39","v":""},{"$f":"'1ERPA'!AQ39","v":""},"","",""]
["","",0,0,0,{"$f":"IF('1ERPA'!F40=\"\",\"\",'1ERPA'!F40)","v":""},null,null,null,null,null,null,null,null,null,null,null,null,null,null,null,null,null,null,null,null,null,null,null,null,null,null,null,null,null,null,"","","",{"$f":"IF('2DOPM'!W43=\"\",\"\",IF('2DOPM'!W43=0,\"\",('2DOPM'!W43)*100))","v":""},"","","",{"$f":"'1ERPA'!AM40","v":""},{"$f":"'1ERPA'!AO40","v":""},{"$f":"'1ERPA'!AQ40","v":""},"","",""]
["","",0,0,0,{"$f":"IF('1ERPA'!F41=\"\",\"\",'1ERPA'!F41)","v":""},null,null,null,null,null,null,null,null,null,null,null,null,null,null,null,null,null,null,null,null,null,null,null,null,null,null,null,null,null,null,"","","",{"$f":"IF('2DOPM'!W44=\"\",\"\",IF('2DOPM'!W44=0,\"\",('2DOPM'!W44)*100))","v":""},"","","",{"$f":"'1ERPA'!AM41","v":""},{"$f":"'1ERPA'!AO41","v":""},{"$f":"'1ERPA'!AQ41","v":""},"","",""]
["","",0,0,0,{"$f":"IF('1ERPA'!F42=\"\",\"\",'1ERPA'!F42)","v":""},null,null,null,null,null,null,null,null,null,null,null,null,null,null,null,null,null,null,null,null,null,null,null,null,null,null,null,null,null,null,"","","",{"$f":"IF('2DOPM'!W45=\"\",\"\",IF('2DOPM'!W45=0,\"\",('2DOPM'!W45)*100))","v":""},"","","",{"$f":"'1ERPA'!AM42","v":""},{"$f":"'1ERPA'!AO42","v":""},{"$f":"'1ERPA'!AQ42","v":""},"","",""]
["","",0,0,0,{"$f":"IF('1ERPA'!F43=\"\",\"\",'1ERPA'!F43)","v":""},null,null,null,null,null,null,null,null,null,null,null,null,null,null,null,null,null,null,null,null,null,null,null,null,null,null,null,null,null,null,"","","",{"$f":"IF('2DOPM'!W46=\"\",\"\",IF('2DOPM'!W46=0,\"\",('2DOPM'!W46)*100))","v":""},"","","",{"$f":"'1ERPA'!AM43","v":""},{"$f":"'1ERPA'!AO43","v":""},{"$f":"'1ERPA'!AQ43","v":""},"","",""]
["","",0,0,0,{"$f":"IF('1ERPA'!F44=\"\",\"\",'1ERPA'!F44)","v":""},null,null,null,null,null,null,null,null,null,null,null,null,null,null,null,null,null,null,null,null,null,null,null,null,null,null,null,null,null,null,"","","",{"$f":"IF('2DOPM'!W47=\"\",\"\",IF('2DOPM'!W47=0,\"\",('2DOPM'!W47)*100))","v":""},"","","",{"$f":"'1ERPA'!AM44","v":""},{"$f":"'1ERPA'!AO44","v":""},{"$f":"'1ERPA'!AQ44","v":""},"","",""]
["","",0,0,0,{"$f":"IF('1ERPA'!F45=\"\",\"\",'1ERPA'!F45)","v":""},null,null,null,null,null,null,null,null,null,null,null,null,null,null,null,null,null,null,null,null,null,null,null,null,null,null,null,null,null,null,"","","",{"$f":"IF('2DOPM'!W48=\"\",\"\",IF('2DOPM'!W48=0,\"\",('2DOPM'!W48)*100))","v":""},"","","",{"$f":"'1ERPA'!AM45","v":""},{"$f":"'1ERPA'!AO45","v":""},{"$f":"'1ERPA'!AQ45","v":""},"","",""]
["","",0,0,0,{"$f":"IF('1ERPA'!F46=\"\",\"\",'1ERPA'!F46)","v":""},null,null,null,null,null,null,null,null,null,null,null,null,null,null,null,null,null,null,null,null,null,null,null,null,null,null,null,null,null,null,"","","",{"$f":"IF('2DOPM'!W49=\"\",\"\",IF('2DOPM'!W49=0,\"\",('2DOPM'!W49)*100))","v":""},"","","",{"$f":"'1ERPA'!AM46","v":""},{"$f":"'1ERPA'!AO46","v":""},{"$f":"'1ERPA'!AQ46","v":""},"","",""]
["","",0,0,0,{"$f":"IF('1ERPA'!F47=\"\",\"\",'1ERPA'!F47)","v":""},null,null,null,null,null,null,null,null,null,null,null,null,null,null,null,null,null,null,null,null,null,null,null,null,null,null,null,null,null,null,"","","",{"$f":"IF('2DOPM'!W50=\"\",\"\",IF('2DOPM'!W50=0,\"\",('2DOPM'!W50)*100))","v":""},"","","",{"$f":"'1ERPA'!AM47","v":""},{"$f":"'1ERPA'!AO47","v":""},{"$f":"'1ERPA'!AQ47","v":""},"","",""]
["","",0,0,0,{"$f":"IF('1ERPA'!F48=\"\",\"\",'1ERPA'!F48)","v":""},null,null,null,null,null,null,null,null,null,null,null,null,null,null,null,null,null,null,null,null,null,null,null,null,null,null,null,null,null,null,"","","",{"$f":"IF('2DOPM'!W51=\"\",\"\",IF('2DOPM'!W51=0,\"\",('2DOPM'!W51)*100))","v":""},"","","",{"$f":"'1ERPA'!AM48","v":""},{"$f":"'1ERPA'!AO48","v":""},{"$f":"'1ERPA'!AQ48","v":""},"","",""]
["","",0,0,0,{"$f":"IF('1ERPA'!F49=\"\",\"\",'1ERPA'!F49)","v":""},null,null,null,null,null,null,null,null,null,null,null,null,null,null,null,null,null,null,null,null,null,null,null,null,null,null,null,null,null,null,"","","",{"$f":"IF('2DOPM'!W52=\"\",\"\",IF('2DOPM'!W52=0,\"\",('2DOPM'!W52)*100))","v":""},"","","",{"$f":"'1ERPA'!AM49","v":""},{"$f":"'1ERPA'!AO49","v":""},{"$f":"'1ERPA'!AQ49","v":""},"","",""]
["","",0,0,0,{"$f":"IF('1ERPA'!F50=\"\",\"\",'1ERPA'!F50)","v":""},null,null,null,null,null,null,null,null,null,null,null,null,null,null,null,null,null,null,null,null,null,null,null,null,null,null,null,null,null,null,"","","",{"$f":"IF('2DOPM'!W53=\"\",\"\",IF('2DOPM'!W53=0,\"\",('2DOPM'!W53)*100))","v":""},"","","",{"$f":"'1ERPA'!AM50","v":""},{"$f":"'1ERPA'!AO50","v":""},{"$f":"'1ERPA'!AQ50","v":""},"","",""]
["","",0,0,0,{"$f":"IF('1ERPA'!F51=\"\",\"\",'1ERPA'!F51)","v":""},null,null,null,null,null,null,null,null,null,null,null,null,null,null,null,null,null,null,null,null,null,null,null,null,null,null,null,null,null,null,"","","",{"$f":"IF('2DOPM'!W54=\"\",\"\",IF('2DOPM'!W54=0,\"\",('2DOPM'!W54)*100))","v":""},"","","",{"$f":"'1ERPA'!AM51","v":""},{"$f":"'1ERPA'!AO51","v":""},{"$f":"'1ERPA'!AQ51","v":""},"","",""]
["","",0,0,0,{"$f":"IF('1ERPA'!F52=\"\",\"\",'1ERPA'!F52)","v":""},null,null,null,null,null,null,null,null,null,null,null,null,null,null,null,null,null,null,null,null,null,null,null,null,null,null,null,null,null,null,"","","",{"$f":"IF('2DOPM'!W55=\"\",\"\",IF('2DOPM'!W55=0,\"\",('2DOPM'!W55)*100))","v":""},"","","",{"$f":"'1ERPA'!AM52","v":""},{"$f":"'1ERPA'!AO52","v":""},{"$f":"'1ERPA'!AQ52","v":""},"","",""]
["","",0,0,0,{"$f":"IF('1ERPA'!F53=\"\",\"\",'1ERPA'!F53)","v":""},null,null,null,null,null,null,null,null,null,null,null,null,null,null,null,null,null,null,null,null,null,null,null,null,null,null,null,null,null,null,"","","",{"$f":"IF('2DOPM'!W56=\"\",\"\",IF('2DOPM'!W56=0,\"\",('2DOPM'!W56)*100))","v":""},"","","",{"$f":"'1ERPA'!AM53","v":""},{"$f":"'1ERPA'!AO53","v":""},{"$f":"'1ERPA'!AQ53","v":""},"","",""]
["","",0,0,0,{"$f":"IF('1ERPA'!F54=\"\",\"\",'1ERPA'!F54)","v":""},null,null,null,null,null,null,null,null,null,null,null,null,null,null,null,null,null,null,null,null,null,null,null,null,null,null,null,null,null,null,"","","",{"$f":"IF('2DOPM'!W57=\"\",\"\",IF('2DOPM'!W57=0,\"\",('2DOPM'!W57)*100))","v":""},"","","",{"$f":"'1ERPA'!AM54","v":""},{"$f":"'1ERPA'!AO54","v":""},{"$f":"'1ERPA'!AQ54","v":""},"","",""]
["","",0,0,0,{"$f":"IF('1ERPA'!F55=\"\",\"\",'1ERPA'!F55)","v":""},null,null,null,null,null,null,null,null,null,null,null,null,null,null,null,null,null,null,null,null,null,null,null,null,null,null,null,null,null,null,"","","",{"$f":"IF('2DOPM'!W58=\"\",\"\",IF('2DOPM'!W58=0,\"\",('2DOPM'!W58)*100))","v":""},"","","",{"$f":"'1ERPA'!AM55","v":""},{"$f":"'1ERPA'!AO55","v":""},{"$f":"'1ERPA'!AQ55","v":""},"","",""]
["","",0,0,0,{"$f":"IF('1ERPA'!F56=\"\",\"\",'1ERPA'!F56)","v":""},null,null,null,null,null,null,null,null,null,null,null,null,null,null,null,null,null,null,null,null,null,null,null,null,null,null,null,null,null,null,"","","",{"$f":"IF('2DOPM'!W59=\"\",\"\",IF('2DOPM'!W59=0,\"\",('2DOPM'!W59)*100))","v":""},"","","",{"$f":"'1ERPA'!AM56","v":""},{"$f":"'1ERPA'!AO56","v":""},{"$f":"'1ERPA'!AQ56","v":""},"","",""]
["","",0,0,0,{"$f":"IF('1ERPA'!F57=\"\",\"\",'1ERPA'!F57)","v":""},null,null,null,null,null,null,null,null,null,null,null,null,null,null,null,null,null,null,null,null,null,null,null,null,null,null,null,null,null,null,"","","",{"$f":"IF('2DOPM'!W60=\"\",\"\",IF('2DOPM'!W60=0,\"\",('2DOPM'!W60)*100))","v":""},"","","",{"$f":"'1ERPA'!AM57","v":""},{"$f":"'1ERPA'!AO57","v":""},{"$f":"'1ERPA'!AQ57","v":""},"","",""]
["","",0,0,0,{"$f":"IF('1ERPA'!F58=\"\",\"\",'1ERPA'!F58)","v":""},null,null,null,null,null,null,null,null,null,null,null,null,null,null,null,null,null,null,null,null,null,null,null,null,null,null,null,null,null,null,"","","",{"$f":"IF('2DOPM'!W61=\"\",\"\",IF('2DOPM'!W61=0,\"\",('2DOPM'!W61)*100))","v":""},"","","",{"$f":"'1ERPA'!AM58","v":""},{"$f":"'1ERPA'!AO58","v":""},{"$f":"'1ERPA'!AQ58","v":""},"","",""]
["","",0,0,0,{"$f":"IF('1ERPA'!F59=\"\",\"\",'1ERPA'!F59)","v":""},null,null,null,null,null,null,null,null,null,null,null,null,null,null,null,null,null,null,null,null,null,null,null,null,null,null,null,null,null,null,"","","",{"$f":"IF('2DOPM'!W62=\"\",\"\",IF('2DOPM'!W62=0,\"\",('2DOPM'!W62)*100))","v":""},"","","",{"$f":"'1ERPA'!AM59","v":""},{"$f":"'1ERPA'!AO59","v":""},{"$f":"'1ERPA'!AQ59","v":""},"","",""]
["","",0,0,0,{"$f":"IF('1ERPA'!F60=\"\",\"\",'1ERPA'!F60)","v":""},null,null,null,null,null,null,null,null,null,null,null,null,null,null,null,null,null,null,null,null,null,null,null,null,null,null,null,null,null,null,"","","",{"$f":"IF('2DOPM'!W63=\"\",\"\",IF('2DOPM'!W63=0,\"\",('2DOPM'!W63)*100))","v":""},"","","",{"$f":"'1ERPA'!AM60","v":""},{"$f":"'1ERPA'!AO60","v":""},{"$f":"'1ERPA'!AQ60","v":""},"","",""]
["","",0,0,0,{"$f":"IF('1ERPA'!F61=\"\",\"\",'1ERPA'!F61)","v":""},null,null,null,null,null,null,null,null,null,null,null,null,null,null,null,null,null,null,null,null,null,null,null,null,null,null,null,null,null,null,"","","",{"$f":"IF('2DOPM'!W64=\"\",\"\",IF('2DOPM'!W64=0,\"\",('2DOPM'!W64)*100))","v":""},"","","",{"$f":"'1ERPA'!AM61","v":""},{"$f":"'1ERPA'!AO61","v":""},{"$f":"'1ERPA'!AQ61","v":""},"","",""]
["","",0,0,0,{"$f":"IF('1ERPA'!F62=\"\",\"\",'1ERPA'!F62)","v":""},null,null,null,null,null,null,null,null,null,null,null,null,null,null,null,null,null,null,null,null,null,null,null,null,null,null,null,null,null,null,"","","",{"$f":"IF('2DOPM'!W65=\"\",\"\",IF('2DOPM'!W65=0,\"\",('2DOPM'!W65)*100))","v":""},"","","",{"$f":"'1ERPA'!AM62","v":""},{"$f":"'1ERPA'!AO62","v":""},{"$f":"'1ERPA'!AQ62","v":""},"","",""]
["","",0,0,0,{"$f":"IF('1ERPA'!F63=\"\",\"\",'1ERPA'!F63)","v":""},null,null,null,null,null,null,null,null,null,null,null,null,null,null,null,null,null,null,null,null,null,null,null,null,null,null,null,null,null,null,"","","",{"$f":"IF('2DOPM'!W66=\"\",\"\",IF('2DOPM'!W66=0,\"\",('2DOPM'!W66)*100))","v":""},"","","",{"$f":"'1ERPA'!AM63","v":""},{"$f":"'1ERPA'!AO63","v":""},{"$f":"'1ERPA'!AQ63","v":""},"","",""]
["","",0,0,0,{"$f":"IF('1ERPA'!F64=\"\",\"\",'1ERPA'!F64)","v":""},null,null,null,null,null,null,null,null,null,null,null,null,null,null,null,null,null,null,null,null,null,null,null,null,null,null,null,null,null,null,"","","",{"$f":"IF('2DOPM'!W67=\"\",\"\",IF('2DOPM'!W67=0,\"\",('2DOPM'!W67)*100))","v":""},"","","",{"$f":"'1ERPA'!AM64","v":""},{"$f":"'1ERPA'!AO64","v":""},{"$f":"'1ERPA'!AQ64","v":""},"","",""]
["","",0,0,0,{"$f":"IF('1ERPA'!F65=\"\",\"\",'1ERPA'!F65)","v":""},null,null,null,null,null,null,null,null,null,null,null,null,null,null,null,null,null,null,null,null,null,null,null,null,null,null,null,null,null,null,"","","",{"$f":"IF('2DOPM'!W68=\"\",\"\",IF('2DOPM'!W68=0,\"\",('2DOPM'!W68)*100))","v":""},"","","",{"$f":"'1ERPA'!AM65","v":""},{"$f":"'1ERPA'!AO65","v":""},{"$f":"'1ERPA'!AQ65","v":""},"","",""]
["","",0,0,0,{"$f":"IF('1ERPA'!F66=\"\",\"\",'1ERPA'!F66)","v":""},null,null,null,null,null,null,null,null,null,null,null,null,null,null,null,null,null,null,null,null,null,null,null,null,null,null,null,null,null,null,"","","",{"$f":"IF('2DOPM'!W69=\"\",\"\",IF('2DOPM'!W69=0,\"\",('2DOPM'!W69)*100))","v":""},"","","",{"$f":"'1ERPA'!AM66","v":""},{"$f":"'1ERPA'!AO66","v":""},{"$f":"'1ERPA'!AQ66","v":""},"","",""]

{"sheet":"2DOPM","index":4,"n_rows":69,"n_cols":25,"rows_kept":69,"cut":false,"hidden":false,"merged":[[3,20,3,21],[4,21,4,22],[0,4,2,22],[10,15,10,20],[11,15,11,20],[13,0,18,0],[13,1,18,1],[13,2,13,7],[13,8,14,17],[13,18,14,19],[15,16,16,17],[13,20,14,21],[13,22,18,22],[14,3,14,5],[15,2,17,2],[15,3,17,3],[15,4,17,4],[15,5,17,5],[15,6,17,6],[15,18,16,19],[15,20,18,20],[15,21,18,21],[15,7,17,7],[15,8,16,9],[15,10,16,11],[15,12,16,13],[15,14,16,15]]}
[null,null,null,null,"MATRIZ DE EVALUACIÓN"]
[]
[]
[null,null,null,null,null,null,null,null,null,null,null,null,null,null,null,null,null,null,null,null,"CICLO ESCOLAR ",null,{"$f":"IF('1ERPA'!W2=\"\",\"\",'1ERPA'!W2)","v":"2018-2019"}]
[null,null,null,null,null,null,null,null,null,null,null,null,null,null,null,null,null,null,null,null,null,{"$f":"IF('2DOPA'!A3=\"\",\"\",'2DOPA'!A3)","v":"SEGUNDO PARCIAL"}]
[]
[null,"LICENCIATURA EN:",{"$f":"IF('1ERPA'!M5=\"\",\"\",'1ERPA'!M5)","v":"Ingeniería en Sistemas Computacionales"}]
[null,"ASIGNATURA:",{"$f":"IF('1ERPA'!AD5=\"\",\"\",'1ERPA'!AD5)","v":"SEGURIDAD INFORMÁTICA Y DE REDES"}]
[null,{"$f":"'1ERPA'!J7","v":"CUATRIMESTRE:"},{"$f":"IF('1ERPA'!K7=\"\",\"\",'1ERPA'!K7)","v":"QUINTO"}]
[null,"GRUPO:",{"$f":"IF('1ERPA'!Q7=\"\",\"\",'1ERPA'!Q7)","v":"A"}]
[null,"PERIODO:",{"$f":"IF('1ERPA'!V7=\"\",\"\",'1ERPA'!V7)","v":"A"},null,null,null,null,null,null,null,null,null,null,null,null,{"$f":"IF('1ERPA'!X10=\"\",\"\",'1ERPA'!X10)","v":"ALDO ORTEGA PACHECO"}]
[null,"COMPETENCIA:","Aplicar herramientas y formas de proteger aplicaciones y en sistemas de cómputo, estableciendo métodos de control y previsión de ataque de virus, interpretando los diferentes tipos de seguridad existentes y técnicas de criptografía aplicables",null,null,null,null,null,null,null,null,null,null,null,null,"NOMBRE Y FIRMA DEL CATEDRÁTICO"]
[null,null,"Identificar los diferentes antivirus que hay en el mercado, así como Instalar, configurar y ejecutar un antivirus ya sea en modo gráfico o en modo consola."]
["No.","Alumnos","Indicadores de desempeño",null,null,null,null,null,{"$f":"IF(H15>S14,\"POR ENCIMA DEL PORCENTAJE\",IF(H15<S14,\"POR DEBAJO DEL PORCENTAJE\",\" Evaluación de evidencias de aprendizaje\"))","v":" Evaluación de evidencias de aprendizaje"},null,null,null,null,null,null,null,null,null,0.5,null,"Fines Formativos",null,"SUMA TOTAL"]
[null,null,{"$f":"SUM(C19:H19)","v":0.5},{"$f":"IF(C15>G15,\"POR ENCIMA DEL PORCENTAJE\",IF(C15<G15,\"POR DEBAJO DEL PORCENTAJE\",\"(Niveles de dominio)\"))","v":"(Niveles de dominio)"},null,null,0.5,{"$f":"SUM(J19,L19,N19,P19,R19,T19)","v":0.5}]
[null,null,"ID1. \nSin nivel \nDefine los administradores del S.O..\nPre-formal\nUtiliza los administradores para explicar el funcionamiento del S.O..\nReceptivo\nElige las tareas principales de los administradores.\nAutónomo\nDemuestra en un simulador el funcionamiento de los administradores del S.O..\n",null,null,null,null,null,"EA1. Realiza una simulación de Auditoria de seguridad en el CSAP\n\nVisita CSAP",null,null,null,null,null,null,null,null,null,null,null,"Autoevaluación","Coevaluación"]
[]
[null,null,null,null,null,null,null,null,"C","P","C","P","C","P","C","P","C","P","C","P"]
[null,null,0.5,null,"","","","",9,0.5]
[{"$f":"IF(B20=\"\",\"\",1)","v":1},{"$f":"IF('1ERPA'!F17=\"\",\"\",'1ERPA'!F17)","v":"GUZMAN SANTOS ALAN"},"Estratégico",null,null,null,null,null,9,{"$f":"IF(I20=\"\",\"\",($J$19/$I$19)*I20)","v":0.5},null,{"$f":"IF(K20=\"\",\"\",($L$19/$K$19)*K20)","v":""},null,{"$f":"IF(M20=\"\",\"\",($N$19/$M$19)*M20)","v":""},null,{"$f":"IF(O20=\"\",\"\",($P$19/$O$19)*O20)","v":""},null,{"$f":"IF(Q20=\"\",\"\",($R$19/$Q$19)*Q20)","v":""},null,{"$f":"IF(S20=\"\",\"\",($T$19/$S$19)*S20)","v":""},null,null,{"$f":"IF(B20=\"\",\"\",(IF(B20=\"\",0,IF(C20=\"Sin Nivel\",($C$19)*0,IF(C20=\"Pre-Formal\",($C$19)*60%,IF(C20=\"Receptivo\",($C$19)*70%,IF(C20=\"Resolutivo\",($C$19)*80%,IF(C20=\"Autónomo\",($C$19)*90%,IF(C20=\"Estratégico\",($C$19)*100%,0)))))))+IF(D20=\"\",0,IF(D20=\"Sin Nivel\",($D$19)*0,IF(D20=\"Pre-Formal\",($D$19)*60%,IF(D20=\"Receptivo\",($D$19)*70%,IF(D20=\"Resolutivo\",($D$19)*80%,IF(D20=\"Autónomo\",($D$19)*90%,IF(D20=\"Estratégico\",($D$19)*100%,0)))))))+IF(E20=\"\",0,IF(E20=\"Sin Nivel\",($E$19)*0,IF(E20=\"Pre-Formal\",($E$19)*60%,IF(E20=\"Receptivo\",($E$19)*70%,IF(E20=\"Resolutivo\",($E$19)*80%,IF(E20=\"Autónomo\",($E$19)*90%,IF(E20=\"Estratégico\",($E$19)*100%,0)))))))+IF(F20=\"\",0,IF(F20=\"Sin Nivel\",($F$19)*0,IF(F20=\"Pre-Formal\",($F$19)*60%,IF(F20=\"Receptivo\",($F$19)*70%,IF(F20=\"Resolutivo\",($F$19)*80%,IF(F20=\"Autónomo\",($F$19)*90%,IF(F20=\"Estratégico\",($F$19)*100%,0)))))))+IF(G20=\"\",0,IF(G20=\"Sin Nivel\",($G$19)*0,IF(G20=\"Pre-Formal\",($G$19)*60%,IF(G20=\"Receptivo\",($G$19)*70%,IF(G20=\"Resolutivo\",($G$19)*80%,IF(G20=\"Autónomo\",($G$19)*90%,IF(G20=\"Estratégico\",($G$19)*100%,0)))))))+IF(H20=\"\",0,IF(H20=\"Sin Nivel\",($H$19)*0,IF(H20=\"Pre-Formal\",($H$19)*60%,IF(H20=\"Receptivo\",($H$19)*70%,IF(H20=\"Resolutivo\",($H$19)*80%,IF(H20=\"Autónomo\",($H$19)*90%,IF(H20=\"Estratégico\",($H$19)*100%,0))))))))+SUM(J20,L20,N20,P20,R20,T20))","v":1},{"$f":"IF(C20=\"\",\"\",(IF(C20=\"\",0,IF(C20=\"Sin Nivel\",($C$19/5)*0,IF(C20=\"Pre-Formal\",($C$19/5)*1,IF(C20=\"Receptivo\",($C$19/5)*2,IF(C20=\"Resolutivo\",($C$19/5)*3,IF(C20=\"Autónomo\",($C$19/5)*4,IF(C20=\"Estratégico\",($C$19/5)*5,0)))))))+IF(D20=\"\",0,IF(D20=\"Sin Nivel\",($D$19/5)*0,IF(D20=\"Pre-Formal\",($D$19/5)*1,IF(D20=\"Receptivo\",($D$19/5)*2,IF(D20=\"Resolutivo\",($D$19/5)*3,IF(D20=\"Autónomo\",($D$19/5)*4,IF(D20=\"Estratégico\",($D$19/5)*5,0)))))))+IF(E20=\"\",0,IF(E20=\"Sin Nivel\",($E$19/5)*0,IF(E20=\"Pre-Formal\",($E$19/5)*1,IF(E20=\"Receptivo\",($E$19/5)*2,IF(E20=\"Resolutivo\",($E$19/5)*3,IF(E20=\"Autónomo\",($E$19/5)*4,IF(E20=\"Estratégico\",($E$19/5)*5,0)))))))+IF(F20=\"\",0,IF(F20=\"Sin Nivel\",($F$19/5)*0,IF(F20=\"Pre-Formal\",($F$19/5)*1,IF(F20=\"Receptivo\",($F$19/5)*2,IF(F20=\"Resolutivo\",($F$19/5)*3,IF(F20=\"Autónomo\",($F$19/5)*4,IF(F20=\"Estratégico\",($F$19/5)*5,0)))))))+IF(G20=\"\",0,IF(G20=\"Sin Nivel\",($G$19/5)*0,IF(G20=\"Pre-Formal\",($G$19/5)*1,IF(G20=\"Receptivo\",($G$19/5)*2,IF(G20=\"Resolutivo\",($G$19/5)*3,IF(G20=\"Autónomo\",($G$19/5)*4,IF(G20=\"Estratégico\",($G$19/5)*5,0)))))))+IF(H20=\"\",0,IF(H20=\"Sin Nivel\",($H$19/5)*0,IF(H20=\"Pre-Formal\",($H$19/5)*1,IF(H20=\"Receptivo\",($H$19/5)*2,IF(H20=\"Resolutivo\",($H$19/5)*3,IF(H20=\"Autónomo\",($H$19/5)*4,IF(H20=\"Estratégico\",($H$19/5)*5,0)))))))))","v":0.5},{"$f":"SUM(J20,L20,N20,P20,R20,T20)","v":0.5}]
[{"$f":"IF(B21=\"\",\"\",A20+1)","v":2},{"$f":"IF('1ERPA'!F18=\"\",\"\",'1ERPA'!F18)","v":"ILLAN MONJARDIN JOSE LUIS"},"Estratégico",null,null,null,null,null,9,{"$f":"IF(I21=\"\",\"\",($J$19/$I$19)*I21)","v":0.5},null,{"$f":"IF(K21=\"\",\"\",($L$19/$K$19)*K21)","v":""},null,{"$f":"IF(M21=\"\",\"\",($N$19/$M$19)*M21)","v":""},null,{"$f":"IF(O21=\"\",\"\",($P$19/$O$19)*O21)","v":""},null,"",null,"",null,null,{"$f":"IF(B21=\"\",\"\",(IF(B21=\"\",0,IF(C21=\"Sin Nivel\",($C$19)*0,IF(C21=\"Pre-Formal\",($C$19)*60%,IF(C21=\"Receptivo\",($C$19)*70%,IF(C21=\"Resolutivo\",($C$19)*80%,IF(C21=\"Autónomo\",($C$19)*90%,IF(C21=\"Estratégico\",($C$19)*100%,0)))))))+IF(D21=\"\",0,IF(D21=\"Sin Nivel\",($D$19)*0,IF(D21=\"Pre-Formal\",($D$19)*60%,IF(D21=\"Receptivo\",($D$19)*70%,IF(D21=\"Resolutivo\",($D$19)*80%,IF(D21=\"Autónomo\",($D$19)*90%,IF(D21=\"Estratégico\",($D$19)*100%,0)))))))+IF(E21=\"\",0,IF(E21=\"Sin Nivel\",($E$19)*0,IF(E21=\"Pre-Formal\",($E$19)*60%,IF(E21=\"Receptivo\",($E$19)*70%,IF(E21=\"Resolutivo\",($E$19)*80%,IF(E21=\"Autónomo\",($E$19)*90%,IF(E21=\"Estratégico\",($E$19)*100%,0)))))))+IF(F21=\"\",0,IF(F21=\"Sin Nivel\",($F$19)*0,IF(F21=\"Pre-Formal\",($F$19)*60%,IF(F21=\"Receptivo\",($F$19)*70%,IF(F21=\"Resolutivo\",($F$19)*80%,IF(F21=\"Autónomo\",($F$19)*90%,IF(F21=\"Estratégico\",($F$19)*100%,0)))))))+IF(G21=\"\",0,IF(G21=\"Sin Nivel\",($G$19)*0,IF(G21=\"Pre-Formal\",($G$19)*60%,IF(G21=\"Receptivo\",($G$19)*70%,IF(G21=\"Resolutivo\",($G$19)*80%,IF(G21=\"Autónomo\",($G$19)*90%,IF(G21=\"Estratégico\",($G$19)*100%,0)))))))+IF(H21=\"\",0,IF(H21=\"Sin Nivel\",($H$19)*0,IF(H21=\"Pre-Formal\",($H$19)*60%,IF(H21=\"Receptivo\",($H$19)*70%,IF(H21=\"Resolutivo\",($H$19)*80%,IF(H21=\"Autónomo\",($H$19)*90%,IF(H21=\"Estratégico\",($H$19)*100%,0))))))))+SUM(J21,L21,N21,P21,R21,T21))","v":1},{"$f":"IF(C21=\"\",\"\",(IF(C21=\"\",0,IF(C21=\"Sin Nivel\",($C$19/5)*0,IF(C21=\"Pre-Formal\",($C$19/5)*1,IF(C21=\"Receptivo\",($C$19/5)*2,IF(C21=\"Resolutivo\",($C$19/5)*3,IF(C21=\"Autónomo\",($C$19/5)*4,IF(C21=\"Estratégico\",($C$19/5)*5,0)))))))+IF(D21=\"\",0,IF(D21=\"Sin Nivel\",($D$19/5)*0,IF(D21=\"Pre-Formal\",($D$19/5)*1,IF(D21=\"Receptivo\",($D$19/5)*2,IF(D21=\"Resolutivo\",($D$19/5)*3,IF(D21=\"Autónomo\",($D$19/5)*4,IF(D21=\"Estratégico\",($D$19/5)*5,0)))))))+IF(E21=\"\",0,IF(E21=\"Sin Nivel\",($E$19/5)*0,IF(E21=\"Pre-Formal\",($E$19/5)*1,IF(E21=\"Receptivo\",($E$19/5)*2,IF(E21=\"Resolutivo\",($E$19/5)*3,IF(E21=\"Autónomo\",($E$19/5)*4,IF(E21=\"Estratégico\",($E$19/5)*5,0)))))))+IF(F21=\"\",0,IF(F21=\"Sin Nivel\",($F$19/5)*0,IF(F21=\"Pre-Formal\",($F$19/5)*1,IF(F21=\"Receptivo\",($F$19/5)*2,IF(F21=\"Resolutivo\",($F$19/5)*3,IF(F21=\"Autónomo\",($F$19/5)*4,IF(F21=\"Estratégico\",($F$19/5)*5,0)))))))+IF(G21=\"\",0,IF(G21=\"Sin Nivel\",($G$19/5)*0,IF(G21=\"Pre-Formal\",($G$19/5)*1,IF(G21=\"Receptivo\",($G$19/5)*2,IF(G21=\"Resolutivo\",($G$19/5)*3,IF(G21=\"Autónomo\",($G$19/5)*4,IF(G21=\"Estratégico\",($G$19/5)*5,0)))))))+IF(H21=\"\",0,IF(H21=\"Sin Nivel\",($H$19/5)*0,IF(H21=\"Pre-Formal\",($H$19/5)*1,IF(H21=\"Receptivo\",($H$19/5)*2,IF(H21=\"Resolutivo\",($H$19/5)*3,IF(H21=\"Autónomo\",($H$19/5)*4,IF(H21=\"Estratégico\",($H$19/5)*5,0)))))))))","v":0.5},{"$f":"SUM(J21,L21,N21,P21,R21,T21)","v":0.5}]
[{"$f":"IF(B22=\"\",\"\",A21+1)","v":3},{"$f":"IF('1ERPA'!F19=\"\",\"\",'1ERPA'!F19)","v":"LA MADRID GONZALEZ FERNANDA ISABEL "},"Receptivo",null,null,null,null,null,7,{"$f":"IF(I22=\"\",\"\",($J$19/$I$19)*I22)","v":0.38888888888888884},null,{"$f":"IF(K22=\"\",\"\",($L$19/$K$19)*K22)","v":""},null,"",null,"",null,"",null,"",null,null,0.73888888888888882,0.2,0.38888888888888884]
[{"$f":"IF(B23=\"\",\"\",A22+1)","v":4},{"$f":"IF('1ERPA'!F20=\"\",\"\",'1ERPA'!F20)","v":"LOPEZ CASTRO GLORIA KARINA"},"Estratégico",null,null,null,null,null,9,{"$f":"IF(I23=\"\",\"\",($J$19/$I$19)*I23)","v":0.5},null,{"$f":"IF(K23=\"\",\"\",($L$19/$K$19)*K23)","v":""},null,{"$f":"IF(M23=\"\",\"\",($N$19/$M$19)*M23)","v":""},null,{"$f":"IF(O23=\"\",\"\",($P$19/$O$19)*O23)","v":""},null,"",null,"",null,null,1]
[{"$f":"IF(B24=\"\",\"\",A23+1)","v":5},{"$f":"IF('1ERPA'!F21=\"\",\"\",'1ERPA'!F21)","v":"GUZMAN SANTOS ALAN"},"Estratégico",null,null,null,null,null,10,{"$f":"IF(I24=\"\",\"\",($J$19/$I$19)*I24)","v":0.55555555555555558},null,{"$f":"IF(K24=\"\",\"\",($L$19/$K$19)*K24)","v":""},null,{"$f":"IF(M24=\"\",\"\",($N$19/$M$19)*M24)","v":""},null,{"$f":"IF(O24=\"\",\"\",($P$19/$O$19)*O24)","v":""},null,"",null,"",null,null,1.0555555555555556,0.5,0.55555555555555558]
[6,{"$f":"IF('1ERPA'!F22=\"\",\"\",'1ERPA'!F22)","v":"Y"},"Estratégico",null,null,null,null,null,11,{"$f":"IF(I25=\"\",\"\",($J$19/$I$19)*I25)","v":0.61111111111111105},null,{"$f":"IF(K25=\"\",\"\",($L$19/$K$19)*K25)","v":""},null,"",null,"",null,"",null,"",null,null,1.1111111111111112,0.5,0.61111111111111105]
[7,{"$f":"IF('1ERPA'!F23=\"\",\"\",'1ERPA'!F23)","v":"U"},"Estratégico",null,null,null,null,null,12,0.66666666666666663,null,"",null,"",null,"",null,{"$f":"IF(Q26=\"\",\"\",($R$19/$Q$19)*Q26)","v":""},null,{"$f":"IF(S26=\"\",\"\",($T$19/$S$19)*S26)","v":""},null,null,1.1666666666666665,0.5,0.66666666666666663]
[8,{"$f":"IF('1ERPA'!F24=\"\",\"\",'1ERPA'!F24)","v":"ILLAN MONJARDIN JOSE LUIS"},"Estratégico",null,null,null,null,null,13,0.72222222222222221,null,"",null,"",null,"",null,"",null,"",null,null,1.2222222222222223,0.5,0.72222222222222221]
[{"$f":"IF(B28=\"\",\"\",A27+1)","v":9},{"$f":"IF('1ERPA'!F25=\"\",\"\",'1ERPA'!F25)","v":"e"},"Estratégico",null,null,null,null,null,14,{"$f":"IF(I28=\"\",\"\",($J$19/$I$19)*I28)","v":0.77777777777777768},null,{"$f":"IF(K28=\"\",\"\",($L$19/$K$19)*K28)","v":""},null,{"$f":"IF(M28=\"\",\"\",($N$19/$M$19)*M28)","v":""},null,{"$f":"IF(O28=\"\",\"\",($P$19/$O$19)*O28)","v":""},null,{"$f":"IF(Q28=\"\",\"\",($R$19/$Q$19)*Q28)","v":""},null,{"$f":"IF(S28=\"\",\"\",($T$19/$S$19)*S28)","v":""},null,null,{"$f":"IF(B28=\"\",\"\",(IF(B28=\"\",0,IF(C28=\"Sin Nivel\",($C$19)*0,IF(C28=\"Pre-Formal\",($C$19)*60%,IF(C28=\"Receptivo\",($C$19)*70%,IF(C28=\"Resolutivo\",($C$19)*80%,IF(C28=\"Autónomo\",($C$19)*90%,IF(C28=\"Estratégico\",($C$19)*100%,0)))))))+IF(D28=\"\",0,IF(D28=\"Sin Nivel\",($D$19)*0,IF(D28=\"Pre-Formal\",($D$19)*60%,IF(D28=\"Receptivo\",($D$19)*70%,IF(D28=\"Resolutivo\",($D$19)*80%,IF(D28=\"Autónomo\",($D$19)*90%,IF(D28=\"Estratégico\",($D$19)*100%,0)))))))+IF(E28=\"\",0,IF(E28=\"Sin Nivel\",($E$19)*0,IF(E28=\"Pre-Formal\",($E$19)*60%,IF(E28=\"Receptivo\",($E$19)*70%,IF(E28=\"Resolutivo\",($E$19)*80%,IF(E28=\"Autónomo\",($E$19)*90%,IF(E28=\"Estratégico\",($E$19)*100%,0)))))))+IF(F28=\"\",0,IF(F28=\"Sin Nivel\",($F$19)*0,IF(F28=\"Pre-Formal\",($F$19)*60%,IF(F28=\"Receptivo\",($F$19)*70%,IF(F28=\"Resolutivo\",($F$19)*80%,IF(F28=\"Autónomo\",($F$19)*90%,IF(F28=\"Estratégico\",($F$19)*100%,0)))))))+IF(G28=\"\",0,IF(G28=\"Sin Nivel\",($G$19)*0,IF(G28=\"Pre-Formal\",($G$19)*60%,IF(G28=\"Receptivo\",($G$19)*70%,IF(G28=\"Resolutivo\",($G$19)*80%,IF(G28=\"Autónomo\",($G$19)*90%,IF(G28=\"Estratégico\",($G$19)*100%,0)))))))+IF(H28=\"\",0,IF(H28=\"Sin Nivel\",($H$19)*0,IF(H28=\"Pre-Formal\",($H$19)*60%,IF(H28=\"Receptivo\",($H$19)*70%,IF(H28=\"Resolutivo\",($H$19)*80%,IF(H28=\"Autónomo\",($H$19)*90%,IF(H28=\"Estratégico\",($H$19)*100%,0))))))))+SUM(J28,L28,N28,P28,R28,T28))","v":1.2777777777777777}]
[10,{"$f":"IF('1ERPA'!F26=\"\",\"\",'1ERPA'!F26)","v":"f"},"Estratégico",null,null,null,null,null,15,0.83333333333333326,null,"",null,"",null,"",null,"",null,"",null,null,1.3333333333333333]
[11,{"$f":"IF('1ERPA'!F27=\"\",\"\",'1ERPA'!F27)","v":"GUZMAN SANTOS ALAN"},"Estratégico",null,null,null,null,null,16,0.88888888888888884,null,"",null,"",null,"",null,"",null,"",null,null,1.3888888888888888]
[12,{"$f":"IF('1ERPA'!F28=\"\",\"\",'1ERPA'!F28)","v":"h"},"Estratégico",null,null,null,null,null,17,0.94444444444444442,null,"",null,"",null,"",null,"",null,"",null,null,1.4444444444444444]
[13,{"$f":"IF('1ERPA'!F29=\"\",\"\",'1ERPA'!F29)","v":"ILLAN MONJARDIN JOSE LUIS"},"Estratégico",null,null,null,null,null,18,1,null,"",null,"",null,"",null,"",null,"",null,null,1.5]
[14,{"$f":"IF('1ERPA'!F30=\"\",\"\",'1ERPA'!F30)","v":"T"},"Estratégico",null,null,null,null,null,19,1.0555555555555556,null,"",null,"",null,"",null,"",null,"",null,null,1.5555555555555556]
["",{"$f":"IF('1ERPA'!F31=\"\",\"\",'1ERPA'!F31)","v":""},"Estratégico",null,null,null,null,null,20,1.1111111111111112,null,"",null,"",null,"",null,"",null,"",null,null,""]
["",{"$f":"IF('1ERPA'!F32=\"\",\"\",'1ERPA'!F32)","v":""},"Estratégico",null,null,null,null,null,21,1.1666666666666665,null,"",null,"",null,"",null,"",null,"",null,null,""]
["",{"$f":"IF('1ERPA'!F33=\"\",\"\",'1ERPA'!F33)","v":""},"Estratégico",null,null,null,null,null,22,1.2222222222222221,null,"",null,"",null,"",null,"",null,"",null,null,""]
["",{"$f":"IF('1ERPA'!F34=\"\",\"\",'1ERPA'!F34)","v":""},"Estratégico",null,null,null,null,null,23,1.2777777777777777,null,"",null,"",null,"",null,"",null,"",null,null,""]
["",{"$f":"IF('1ERPA'!F35=\"\",\"\",'1ERPA'!F35)","v":""},"Estratégico",null,null,null,null,null,24,1.3333333333333333,null,"",null,"",null,"",null,"",null,"",null,null,""]
["",{"$f":"IF('1ERPA'!F36=\"\",\"\",'1ERPA'!F36)","v":""},"Estratégico",null,null,null,null,null,25,1.3888888888888888,null,"",null,"",null,"",null,"",null,"",null,null,""]
["",{"$f":"IF('1ERPA'!F37=\"\",\"\",'1ERPA'!F37)","v":""},"Estratégico",null,null,null,null,null,26,1.4444444444444444,null,"",null,"",null,"",null,"",null,"",null,null,""]
["",{"$f":"IF('1ERPA'!F38=\"\",\"\",'1ERPA'!F38)","v":""},"Estratégico",null,null,null,null,null,27,1.5,null,"",null,"",null,"",null,"",null,"",null,null,""]
["",{"$f":"IF('1ERPA'!F39=\"\",\"\",'1ERPA'!F39)","v":""},"Estratégico",null,null,null,null,null,28,1.5555555555555554,null,"",null,"",null,"",null,"",null,"",null,null,""]
["",{"$f":"IF('1ERPA'!F40=\"\",\"\",'1ERPA'!F40)","v":""},"Estratégico",null,null,null,null,null,29,1.6111111111111109,null,"",null,"",null,"",null,"",null,"",null,null,""]
["",{"$f":"IF('1ERPA'!F41=\"\",\"\",'1ERPA'!F41)","v":""},"Estratégico",null,null,null,null,null,30,1.6666666666666665,null,"",null,"",null,"",null,"",null,"",null,null,""]
["",{"$f":"IF('1ERPA'!F42=\"\",\"\",'1ERPA'!F42)","v":""},"Estratégico",null,null,null,null,null,31,1.7222222222222221,null,"",null,"",null,"",null,"",null,"",null,null,""]
["",{"$f":"IF('1ERPA'!F43=\"\",\"\",'1ERPA'!F43)","v":""},null,null,null,null,null,null,null,"",null,"",null,"",null,"",null,"",null,"",null,null,""]
["",{"$f":"IF('1ERPA'!F44=\"\",\"\",'1ERPA'!F44)","v":""},null,null,null,null,null,null,null,"",null,"",null,"",null,"",null,"",null,"",null,null,"","",0]
["",{"$f":"IF('1ERPA'!F45=\"\",\"\",'1ERPA'!F45)","v":""},null,null,null,null,null,null,null,"",null,"",null,"",null,"",null,"",null,"",null,null,"","",0]
["",{"$f":"IF('1ERPA'!F46=\"\",\"\",'1ERPA'!F46)","v":""},null,null,null,null,null,null,null,"",null,"",null,"",null,"",null,"",null,"",null,null,"","",0]
["",{"$f":"IF('1ERPA'!F47=\"\",\"\",'1ERPA'!F47)","v":""},null,null,null,null,null,null,null,"",null,"",null,"",null,"",null,"",null,"",null,null,"","",0]
["",{"$f":"IF('1ERPA'!F48=\"\",\"\",'1ERPA'!F48)","v":""},null,null,null,null,null,null,null,"",null,"",null,"",null,"",null,"",null,"",null,null,"","",0]
["",{"$f":"IF('1ERPA'!F49=\"\",\"\",'1ERPA'!F49)","v":""},null,null,null,null,null,null,null,"",null,"",null,"",null,"",null,"",null,"",null,null,"","",0]
["",{"$f":"IF('1ERPA'!F50=\"\",\"\",'1ERPA'!F50)","v":""},null,null,null,null,null,null,null,{"$f":"IF(I53=\"\",\"\",($J$19/$I$19)*I53)","v":""},null,{"$f":"IF(K53=\"\",\"\",($L$19/$K$19)*K53)","v":""},null,"",null,"",null,"",null,"",null,null,"","",0]
["",{"$f":"IF('1ERPA'!F51=\"\",\"\",'1ERPA'!F51)","v":""},null,null,null,null,null,null,null,"",null,"",null,"",null,"",null,"",null,"",null,null,"","",0]
["",{"$f":"IF('1ERPA'!F52=\"\",\"\",'1ERPA'!F52)","v":""},null,null,null,null,null,null,null,"",null,"",null,"",null,"",null,"",null,"",null,null,"","",0]
["",{"$f":"IF('1ERPA'!F53=\"\",\"\",'1ERPA'!F53)","v":""},null,null,null,null,null,null,null,"",null,"",null,"",null,"",null,"",null,"",null,null,"","",0]
["",{"$f":"IF('1ERPA'!F54=\"\",\"\",'1ERPA'!F54)","v":""},null,null,null,null,null,null,null,"",null,"",null,"",null,"",null,"",null,"",null,null,"","",0]
["",{"$f":"IF('1ERPA'!F55=\"\",\"\",'1ERPA'!F55)","v":""},null,null,null,null,null,null,null,"",null,"",null,"",null,"",null,"",null,"",null,null,"","",0]
["",{"$f":"IF('1ERPA'!F56=\"\",\"\",'1ERPA'!F56)","v":""},null,null,null,null,null,null,null,"",null,"",null,"",null,"",null,"",null,"",null,null,"","",0]
["",{"$f":"IF('1ERPA'!F57=\"\",\"\",'1ERPA'!F57)","v":""},null,null,null,null,null,null,null,"",null,"",null,"",null,"",null,"",null,"",null,null,"","",0]
["",{"$f":"IF('1ERPA'!F58=\"\",\"\",'1ERPA'!F58)","v":""},null,null,null,null,null,null,null,"",null,"",null,"",null,"",null,"",null,"",null,null,"","",0]
["",{"$f":"IF('1ERPA'!F59=\"\",\"\",'1ERPA'!F59)","v":""},null,null,null,null,null,null,null,"",null,"",null,"",null,"",null,"",null,"",null,null,"","",0]
["",{"$f":"IF('1ERPA'!F60=\"\",\"\",'1ERPA'!F60)","v":""},null,null,null,null,null,null,null,"",null,"",null,"",null,"",null,"",null,"",null,null,"","",0]
["",{"$f":"IF('1ERPA'!F61=\"\",\"\",'1ERPA'!F61)","v":""},null,null,null,null,null,null,null,"",null,"",null,"",null,"",null,"",null,"",null,null,"","",0]
["",{"$f":"IF('1ERPA'!F62=\"\",\"\",'1ERPA'!F62)","v":""},null,null,null,null,null,null,null,"",null,"",null,"",null,"",null,"",null,"",null,null,"","",0]
["",{"$f":"IF('1ERPA'!F63=\"\",\"\",'1ERPA'!F63)","v":""},null,null,null,null,null,null,null,"",null,"",null,"",null,"",null,"",null,"",null,null,"","",0]
["",{"$f":"IF('1ERPA'!F64=\"\",\"\",'1ERPA'!F64)","v":""},null,null,null,null,null,null,null,"",null,"",null,"",null,"",null,"",null,"",null,null,"","",0]
["",{"$f":"IF('1ERPA'!F65=\"\",\"\",'1ERPA'!F65)","v":""},null,null,null,null,null,null,null,"",null,"",null,"",null,"",null,"",null,"",null,null,"","",0]
["",{"$f":"IF('1ERPA'!F66=\"\",\"\",'1ERPA'!F66)","v":""},null,null,null,null,null,null,null,"",null,"",null,"",null,"",null,"",null,"",null,null,"","",0]

{"sheet":"2DOPRE","index":5,"n_rows":47,"n_cols":39,"rows_kept":47,"cut":false,"hidden":false,"merged":[[39,1,39,40],[50,1,50,20],[50,21,50,40],[47,1,47,20],[47,21,47,40],[48,1,48,20],[48,21,48,40],[49,1,49,20],[49,21,49,40],[42,1,42,40],[43,1,43,40],[45,1,45,40],[46,1,46,20],[46,21,46,40],[41,1,41,40],[30,1,30,40],[31,1,31,20],[31,21,31,40],[40,1,40,40],[33,1,33,20],[33,21,33,40],[34,1,34,20],[34,21,34,40],[35,1,35,20],[35,21,35,40],[32,1,32,20],[32,21,32,40],[36,1,36,20],[36,21,36,40],[37,1,37,20],[37,21,37,40],[28,18,28,28],[21,4,21,6],[21,16,22,16],[21,17,22,17],[21,37,22,37],[22,4,22,6],[22,26,22,28],[22,34,22,36],[26,30,27,31],[26,32,27,32],[26,33,27,33],[26,34,27,36],[26,37,27,37],[17,2,19,8],[17,11,19,21],[17,24,19,30],[17,33,19,39],[26,38,27,39],[27,18,27,28],[21,38,22,38],[9,2,11,8],[9,11,11,21],[9,24,11,30],[9,33,11,39],[13,18,14,18],[13,19,14,19],[13,37,14,37],[13,38,14,38],[14,3,14,7],[14,13,14,17],[14,26,14,28],[14,34,14,36],[0,29,1,40],[2,31,2,40],[3,5,6,15],[5,26,5,27],[5,29,5,31],[5,34,5,39]]}
[null,null,null,null,null,null,null,null,null,null,null,null,null,null,null,null,null,null,null,null,null,null,null,null,null,null,null,null,null,{"$f":"IF('1ERPA'!M5=\"\",\"\",'1ERPA'!M5)","v":"Ingeniería en Sistemas Computacionales"}]
[]
[null,null,null,null,null,null,null,null,null,null,null,null,null,null,null,null,null,null,null,null,null,null,null,null,null,null,null,null,null,null,null,{"$f":"IF(MAX('1ERPA'!A17:A66)=0,\"\",MAX('1ERPA'!A17:A66))","v":14}]
[]
[]
[null,null,null,null,null,null,null,null,null,null,null,null,null,null,null,null,null,null,null,null,null,null,null,null,null,null,"2do.",null,null,{"$f":"'1ERPA'!K7","v":"QUINTO"},null,null,{"$f":"IF('1ERPA'!Q7=\"\",\"\",'1ERPA'!Q7)","v":"A"},null,{"$f":"IF('1ERPA'!AD5=\"\",\"\",'1ERPA'!AD5)","v":"SEGURIDAD INFORMÁTICA Y DE REDES"}]
[]
[]
[]
[null,null,"PROMEDIO MENSUAL ASISTENCIA",null,null,null,null,null,null,null,null,"SUSTITUCIÓN",null,null,null,null,null,null,null,null,null,null,null,null,"PORCENTAJE DE APROBACIÓN",null,null,null,null,null,null,null,null,"SUSTITUCÓN"]
[]
[]
[]
[null,null,null,"AR","*","CI","-","F",null,null,null,null,null,{"$f":"AF3","v":14},"*",{"$f":"'2DOPA'!AK15","v":10},"-",{"$f":"'2DOPA'!AL15","v":1},"=",{"$f":"IF(N15=0,0,((N14*P14)-R14)/N15)","v":13.9},null,null,null,null,null,null,"AA","*",100,null,null,null,null,null,{"$f":"COUNTIF('2DOPA'!AO16:AO65,\">=6\")","v":14},"*",100,"=",{"$f":"IF(AI15=\"\",0,(AI14*AK14)/AI15)","v":100}]
[null,null,null,"CI",null,null,null,null,null,null,null,null,null,{"$f":"'2DOPA'!AK15","v":10},null,null,null,null,null,null,null,null,null,null,null,null,"AR",null,null,null,null,null,null,null,{"$f":"AF3","v":14}]
[]
[]
[null,null,"PROMEDIO DE EFICIENCIA",null,null,null,null,null,null,null,null,"SUSTITUCIÓN",null,null,null,null,null,null,null,null,null,null,null,null,"PORCENTAJE DE AVANCE PROGRAMÁTICO",null,null,null,null,null,null,null,null,"SUSTITUCÓN"]
[]
[]
[]
[null,null,null,null,"∑Cal",null,null,null,null,null,null,null,null,null,null,{"$f":"SUM('2DOPA'!AN17:AN66)/10","v":167.94444444444443},"=",{"$f":"IF(P23=\"\",0,P22/P23)","v":11.996031746031745},null,null,null,null,null,null,null,null,"TI","*",100,null,null,null,null,null,12,"*",{"$f":"AC22","v":100},"=",{"$f":"IF(AI23=\"\",0,(AI22*AK22)/AI23)","v":100}]
[null,null,null,null,"AR",null,null,null,null,null,null,null,null,null,null,{"$f":"AF3","v":14},null,null,null,null,null,null,null,null,null,null,"TP",null,null,null,null,null,null,null,12]
[]
[]
[null,null,"SIMBOLOGÍA",null,null,null,null,null,null,null,"CI:","Número de clases impartidas"]
[null,null,"AR:","Cantidad de alumnos regulares",null,null,null,null,null,null,"AA:","Cantidad de alumnos aprobados",null,null,null,null,null,null,null,null,null,null,null,null,null,null,null,null,null,null,"PUEBLA,",null,29,"DE","OCTUBRE",null,null,"DE",2018]
[null,null,"F:","Faltas de alumnos en el periodo",null,null,null,null,null,null,"TI:","Temas impartidos",null,null,null,null,null,null,{"$f":"IF('1ERPA'!X10=\"\",\"\",'1ERPA'!X10)","v":"ALDO ORTEGA PACHECO"}]
[null,null,"Cal:","Calificaciones",null,null,null,null,null,null,"TP:","Temas programados",null,null,null,null,null,null,"NOMBRE Y FIRMA DEL CATEDRÁTICO",null,null,null,null,null,null,null,null,null,null,null,"SD/F"]
[]
[null,"ALUMNOS REPROBADOS Y CAUSA DE LA REPROBACIÓN"]
[null,"NOMBRE COMPLETO DEL ALUMNO",null,null,null,null,null,null,null,null,null,null,null,null,null,null,null,null,null,null,null,"CAUSA"]
[{"$f":"A32+1","v":1},{"$f":"IFERROR(VLOOKUP(A33,'2DOPA'!$E$17:$F$66,2,FALSE),\"\")","v":""},null,null,null,null,null,null,null,null,null,null,null,null,null,null,null,null,null,null,null,{"$f":"IF(B33=\"\",\"\",IF(IFERROR(VLOOKUP(B33,'2DOPA'!$F$17:$AO$66,36,FALSE),0)=$AE$29,\"SIN DERECHO POR FALTAS\",IF(VLOOKUP(B33,'2DOPM'!B20:Y69,22,FALSE)<0.3,IF(VLOOKUP(B33,'2DOPM'!B20:Y69,21,FALSE)<0.3,\"NO ENTREGO, LOS INDICADORES DE DESEMPEÑO Y EVIDENCIAS DE APRENDIZAJE NECESARIAS PARA APROBAR\",\"NO ENTREGO, LOS INDICADORES DE DESEMPEÑO NECESARIOS PARA APROBAR\"),\"NO ENTREGO, LAS EVIDENCIAS DE APRENDIZAJE NECESARIOS PARA APROBAR\")))","v":""}]
[2,{"$f":"IFERROR(VLOOKUP(A34,'2DOPA'!$E$17:$F$66,2,FALSE),\"\")","v":""},null,null,null,null,null,null,null,null,null,null,null,null,null,null,null,null,null,null,null,{"$f":"IF(B34=\"\",\"\",IF(IFERROR(VLOOKUP(B34,'2DOPA'!$F$17:$AO$66,36,FALSE),0)=$AE$29,\"SIN DERECHO POR FALTAS\",IF(VLOOKUP(B34,'2DOPM'!B21:Y70,22,FALSE)<0.3,IF(VLOOKUP(B34,'2DOPM'!B21:Y70,21,FALSE)<0.3,\"NO ENTREGO, LOS INDICADORES DE DESEMPEÑO Y EVIDENCIAS DE APRENDIZAJE NECESARIAS PARA APROBAR\",\"NO ENTREGO, LOS INDICADORES DE DESEMPEÑO NECESARIOS PARA APROBAR\"),\"NO ENTREGO, LAS EVIDENCIAS DE APRENDIZAJE NECESARIOS PARA APROBAR\")))","v":""}]
[3,{"$f":"IFERROR(VLOOKUP(A35,'2DOPA'!$E$17:$F$66,2,FALSE),\"\")","v":""},null,null,null,null,null,null,null,null,null,null,null,null,null,null,null,null,null,null,null,{"$f":"IF(B35=\"\",\"\",IF(IFERROR(VLOOKUP(B35,'2DOPA'!$F$17:$AO$66,36,FALSE),0)=$AE$29,\"SIN DERECHO POR FALTAS\",IF(VLOOKUP(B35,'2DOPM'!B22:Y71,22,FALSE)<0.3,IF(VLOOKUP(B35,'2DOPM'!B22:Y71,21,FALSE)<0.3,\"NO ENTREGO, LOS INDICADORES DE DESEMPEÑO Y EVIDENCIAS DE APRENDIZAJE NECESARIAS PARA APROBAR\",\"NO ENTREGO, LOS INDICADORES DE DESEMPEÑO NECESARIOS PARA APROBAR\"),\"NO ENTREGO, LAS EVIDENCIAS DE APRENDIZAJE NECESARIOS PARA APROBAR\")))","v":""}]
[4,{"$f":"IFERROR(VLOOKUP(A36,'2DOPA'!$E$17:$F$66,2,FALSE),\"\")","v":""},null,null,null,null,null,null,null,null,null,null,null,null,null,null,null,null,null,null,null,{"$f":"IF(B36=\"\",\"\",IF(IFERROR(VLOOKUP(B36,'2DOPA'!$F$17:$AO$66,36,FALSE),0)=$AE$29,\"SIN DERECHO POR FALTAS\",IF(VLOOKUP(B36,'2DOPM'!B24:Y72,22,FALSE)<0.3,IF(VLOOKUP(B36,'2DOPM'!B24:Y72,21,FALSE)<0.3,\"NO ENTREGO, LOS INDICADORES DE DESEMPEÑO Y EVIDENCIAS DE APRENDIZAJE NECESARIAS PARA APROBAR\",\"NO ENTREGO, LOS INDICADORES DE DESEMPEÑO NECESARIOS PARA APROBAR\"),\"NO ENTREGO, LAS EVIDENCIAS DE APRENDIZAJE NECESARIOS PARA APROBAR\")))","v":""}]
[5,{"$f":"IFERROR(VLOOKUP(A37,'2DOPA'!$E$17:$F$66,2,FALSE),\"\")","v":""},null,null,null,null,null,null,null,null,null,null,null,null,null,null,null,null,null,null,null,{"$f":"IF(B37=\"\",\"\",IF(IFERROR(VLOOKUP(B37,'2DOPA'!$F$17:$AO$66,36,FALSE),0)=$AE$29,\"SIN DERECHO POR FALTAS\",IF(VLOOKUP(B37,'2DOPM'!B25:Y73,22,FALSE)<0.3,IF(VLOOKUP(B37,'2DOPM'!B25:Y73,21,FALSE)<0.3,\"NO ENTREGO, LOS INDICADORES DE DESEMPEÑO Y EVIDENCIAS DE APRENDIZAJE NECESARIAS PARA APROBAR\",\"NO ENTREGO, LOS INDICADORES DE DESEMPEÑO NECESARIOS PARA APROBAR\"),\"NO ENTREGO, LAS EVIDENCIAS DE APRENDIZAJE NECESARIOS PARA APROBAR\")))","v":""}]
[6,{"$f":"IF('2DOPA'!E16>6,\"Y \"&'2DOPA'!E16-5&\" MÁS REPROBADOS\",IFERROR(VLOOKUP(A38,'2DOPA'!$E$17:$F$66,2,FALSE),\"\"))","v":""},null,null,null,null,null,null,null,null,null,null,null,null,null,null,null,null,null,null,null,{"$f":"IF(IFERROR(VLOOKUP(A38,'2DOPA'!$E$17:$F$66,2,FALSE),\"\")=B38,IF(B38=\"\",\"\",IF(IFERROR(VLOOKUP(B38,'2DOPA'!$F$17:$AO$66,36,FALSE),0)=$AE$29,\"SIN DERECHO POR FALTAS\",IF(VLOOKUP(B38,'2DOPM'!B26:Y74,22,FALSE)<0.3,IF(VLOOKUP(B38,'2DOPM'!B26:Y74,21,FALSE)<0.3,\"NO ENTREGO, LOS INDICADORES DE DESEMPEÑO Y EVIDENCIAS DE APRENDIZAJE NECESARIAS PARA APROBAR\",\"NO ENTREGO, LOS INDICADORES DE DESEMPEÑO NECESARIOS PARA APROBAR\"),\"NO ENTREGO, LAS EVIDENCIAS DE APRENDIZAJE NECESARIOS PARA APROBAR\"))),\"SIN DERECHO POR FALTAS Y/O POR NO ENTREGAR LAS EVIDENCIAS NECESARIAS\")","v":""}]
[null,null,null,null,null,null,null,null,null,null,null,null,null,null,null,null,null,null,null,null,null,null,null,null,null,null,null,null,{"$f":"IF('1ERPA'!$C$16<>0,\"CONTACTAR A LOS ALUMNOS PARA SABER QUE SUCEDE\",IF('1ERPA'!$D$16<>0,\"ASESORIAS PARA QUE MEJORE SU CALIFICACIÓN\",\"\"))","v":""}]
[null,"PROPUESTA DE SOLUCIÓN PARA REDUCIR EL PORCENTAJE DE REPROBACIÓN"]
[null,{"$f":"IF(AND('2DOPA'!C16>0,'2DOPA'!D16=0),\"CONTACTAR A LOS ALUMNOS PARA SABER QUE SUCEDE CON SUS ASISTENCIAS\",IF(AND('2DOPA'!C16=0,'2DOPA'!D16>0),\"ASESORIAS PARA QUE MEJOREN SUS CALIFICACIONES\",IF(AND('2DOPA'!C16>0,'2DOPA'!D16>0),\"ASESORIAS PARA QUE MEJOREN SUS CALIFICACIONES Y CONTACTAR A LOS ALUMNOS PARA SABER QUE SUCEDE CON SUS ASISTENCIAS\",\"\")))","v":""}]
[]
[]
[]
[]
[null,"TEMAS PENDIENTES DEL PERIODO QUE SE REPORTAN"]
[null,"TEMA(S)",null,null,null,null,null,null,null,null,null,null,null,null,null,null,null,null,null,null,null,"MOTIVO(S)"]

{"sheet":"3ERPA","index":6,"n_rows":67,"n_cols":52,"rows_kept":67,"cut":false,"hidden":false,"merged":[[10,43,15,43],[14,42,15,42],[8,43,9,45],[8,46,9,48],[8,49,15,49],[10,44,15,44],[8,50,15,50],[8,51,15,51],[10,45,15,45],[10,46,15,46],[10,47,15,47],[10,48,15,48],[8,0,15,0],[8,5,15,5],[8,36,13,36],[8,37,13,37],[8,38,13,38],[9,23,9,34],[10,23,10,34],[11,6,11,35],[14,36,15,36],[14,37,15,37],[14,38,15,38],[6,10,6,12],[8,39,8,42],[9,39,13,40],[9,41,15,41],[9,42,13,42],[14,39,15,39],[14,40,15,40],[12,6,12,19],[12,20,12,21],[12,22,12,35],[0,0,0,51],[2,0,2,51],[4,12,4,23],[4,29,4,34],[1,21,1,26],[1,27,1,29]]}
["CONTROL DE ASISTENCIA Y EVALUACIONES"]
[null,null,null,null,null,null,null,null,null,null,null,null,null,null,null,null,null,null,null,null,null,"CICLO ESCOLAR ",null,null,null,null,null,{"$f":"IF('1ERPA'!W2=\"\",\"\",'1ERPA'!W2)","v":"2018-2019"}]
["ORDINARIO"]
[]
[null,null,null,null,null,null,null,null,null,null,null,"LICENCIATURA EN: ",{"$f":"IF('1ERPA'!M5=\"\",\"\",'1ERPA'!M5)","v":"Ingeniería en Sistemas Computacionales"},null,null,null,null,null,null,null,null,null,null,null,null,null,null,null,"ASIGNATURA: ",{"$f":"IF('1ERPA'!AD5=\"\",\"\",'1ERPA'!AD5)","v":"SEGURIDAD INFORMÁTICA Y DE REDES"}]
[]
[null,null,null,null,null,null,null,null,null,{"$f":"'1ERPA'!J7","v":"CUATRIMESTRE:"},{"$f":"IF('1ERPA'!K7=\"\",\"\",'1ERPA'!K7)","v":"QUINTO"},null,null,null,null,"GRUPO:",{"$f":"IF('1ERPA'!Q7=\"\",\"\",'1ERPA'!Q7)","v":"A"},null,null,null,"PERIODO: ",{"$f":"IF('1ERPA'!V7=\"\",\"\",'1ERPA'!V7)","v":"A"}]
[]
["No.",null,null,null,null,"NOMBRE DEL ALUMNO",null,"SIMBOLOGIA:",null,null,null,"A:","ASISTENCIA",null,null,null,null,null,null,null,null,null,null,null,null,null,null,null,null,null,null,null,null,null,null,null,"CLASES IMPARTIDAS","TOTAL FALTAS","% ASISTENCIA","EVALUACIÓN",null,null,null,"PRIMER PARCIAL",null,null,"SEGUNDO PARCIAL",null,null,"PROMEDIO % ASISTENCIA","PROMEDIO DE CALIFICACIONES","SUMA DEL % PARCIALES"]
[null,null,null,null,null,null,null,null,null,null,null,"F:","FALTA",null,null,null,null,null,null,null,null,null,null,{"$f":"IF('1ERPA'!X10=\"\",\"\",'1ERPA'!X10)","v":"ALDO ORTEGA PACHECO"},null,null,null,null,null,null,null,null,null,null,null,null,null,null,null,"CALIFICACIÓN",null,"CALIF. CON LETRA","% PARCIAL"]
[null,null,null,null,null,null,null,null,null,null,null,"J:","JUSTIFICACIÓN",null,null,null,null,null,null,null,null,null,null,"NOMBRE Y FIRMA DEL CATEDRÁTICO",null,null,null,null,null,null,null,null,null,null,null,null,null,null,null,null,null,null,null,"% ASISTENCIA","CALIFICACIÓN","% PARCIAL","% ASISTENCIA","CALIFICACIÓN","% PARCIAL"]
[null,null,null,null,null,null,"SEGUNDO PARCIAL"]
[null,null,null,null,null,null,"MAYO",null,null,null,null,null,null,null,null,null,null,null,null,null,"-",null,"JUNIO"]
[null,null,null,null,null,null,"Ma","Ma","Ma","Ma","Ma"]
[null,null,null,null,null,null,19,26,2,9,16,null,null,null,null,null,null,null,null,null,null,null,null,null,null,null,null,null,null,null,null,null,null,null,null,null,{"$f":"COUNT(G15:AJ15)","v":5},{"$f":"SUM(AL17:AL44)","v":0},{"$f":"100/AK15","v":20},"%","T",null,50]
[null,null,{"$f":"COUNTIF(C17:C67,\"=1\")","v":0},{"$f":"COUNTIF(D17:D67,\"=1\")","v":8},{"$f":"C16+D16","v":8},null,3,3,3,3,3]
[{"$f":"IF(F17=\"\",\"\",1)","v":1},{"$f":"AO17","v":3},{"$f":"IF(B17=\"SD/F\",1,0)","v":0},{"$f":"IF(B17<6,1,0)","v":1},{"$f":"IF(B17=\"SD/F\",1,IF(B17<6,1,0))","v":1},{"$f":"IF('1ERPA'!F17=\"\",\"\",'1ERPA'!F17)","v":"GUZMAN SANTOS ALAN"},"A","A","A","A","A",null,null,null,null,null,null,null,null,null,null,null,null,null,null,null,null,null,null,null,null,null,null,null,null,null,{"$f":"IF(G17=\"\",\"\",COUNTIF(G17:AJ17,\"A\")+COUNTIF(G17:AJ17,\"J\"))","v":5},{"$f":"IF(AK17=\"\",\"\",COUNTIF(G17:AJ17,\"F\"))","v":0},{"$f":"IF(AK17=\"\",\"\",($AK$15-AL17)*$AM$15)","v":100},{"$f":"IF('3ERPM'!W20=\"\",\"\",IF('3ERPM'!W20=0,\"\",('3ERPM'!W20)*100))","v":28.900000000000002},{"$f":"IF(AM17<80,\"SD/F\",IF(AN17=\"\",\"\",IF(AN17>=96,10,IF(AN17>=86,9,IF(AN17>=76,8,IF(AN17>=66,7,IF(AN17>=56,6,IF(AN17>=46,5,IF(AN17>=36,4,IF(AN17>=26,3,IF(AN17>=16,2,IF(AN17>=6,1,IF(AN17>=0,0,\"\")))))))))))))","v":3},{"$f":"IF(AM17<80,\"SD/F\",IF(AO17=\"\",\"\",IF(AO17>=9.6,\"DIEZ\",IF(AO17>=8.6,\"NUEVE\",IF(AO17>=7.6,\"OCHO\",IF(AO17>=6.6,\"SIETE\",IF(AO17>=5.6,\"SEIS\",IF(AO17>=4.6,\"CINCO\",IF(AO17>=3.6,\"CUATRO\",IF(AO17>=2.6,\"TRES\",IF(AO17>=1.6,\"DOS\",IF(AO17>=0.6,\"UNO\",IF(AO17>=0,\"CERO\",\"\")))))))))))))","v":"TRES"},{"$f":"IF(AP17=\"\",\"\",IF(AP17=\"SD/F\",0,($AQ$15/10)*AO17))","v":15},{"$f":"'1ERPA'!AM17","v":100},{"$f":"'1ERPA'!AO17","v":9},{"$f":"'1ERPA'!AQ17","v":22.5},{"$f":"'2DOPA'!AM17","v":100},{"$f":"'2DOPA'!AO17","v":10},{"$f":"'2DOPA'!AQ17","v":25},{"$f":"IF(AM17=\"\",\"\",AVERAGE(AM17,AR17,AU17))","v":100},{"$f":"IF(AO17=\"\",\"\",AVERAGE(AO17,AS17,AV17))","v":7.333333333333333},{"$f":"IF(AQ17=\"\",\"\",SUM(AQ17,AT17,AW17))","v":62.5}]
[{"$f":"IF(F18=\"\",\"\",A17+1)","v":2},3,{"$f":"IF(B18=\"SD/F\",1,0)","v":0},{"$f":"IF(B18<6,1,0)","v":1},{"$f":"IF(B18=\"SD/F\",E17+1,IF(B18<6,E17+1,E17))","v":2},{"$f":"IF('1ERPA'!F18=\"\",\"\",'1ERPA'!F18)","v":"ILLAN MONJARDIN JOSE LUIS"},"A","A","A","A","A",null,null,null,null,null,null,null,null,null,null,null,null,null,null,null,null,null,null,null,null,null,null,null,null,null,{"$f":"IF(G18=\"\",\"\",COUNTIF(G18:AJ18,\"A\")+COUNTIF(G18:AJ18,\"J\"))","v":5},{"$f":"IF(AK18=\"\",\"\",COUNTIF(G18:AJ18,\"F\"))","v":0},{"$f":"IF(AK18=\"\",\"\",($AK$15-AL18)*$AM$15)","v":100},{"$f":"IF('3ERPM'!W21=\"\",\"\",IF('3ERPM'!W21=0,\"\",('3ERPM'!W21)*100))","v":29.500000000000004},{"$f":"IF(AM18<80,\"SD/F\",IF(AN18=\"\",\"\",IF(AN18>=96,10,IF(AN18>=86,9,IF(AN18>=76,8,IF(AN18>=66,7,IF(AN18>=56,6,IF(AN18>=46,5,IF(AN18>=36,4,IF(AN18>=26,3,IF(AN18>=16,2,IF(AN18>=6,1,IF(AN18>=0,0,\"\")))))))))))))","v":3},{"$f":"IF(AM18<80,\"SD/F\",IF(AO18=\"\",\"\",IF(AO18>=9.6,\"DIEZ\",IF(AO18>=8.6,\"NUEVE\",IF(AO18>=7.6,\"OCHO\",IF(AO18>=6.6,\"SIETE\",IF(AO18>=5.6,\"SEIS\",IF(AO18>=4.6,\"CINCO\",IF(AO18>=3.6,\"CUATRO\",IF(AO18>=2.6,\"TRES\",IF(AO18>=1.6,\"DOS\",IF(AO18>=0.6,\"UNO\",IF(AO18>=0,\"CERO\",\"\")))))))))))))","v":"TRES"},{"$f":"IF(AP18=\"\",\"\",IF(AP18=\"SD/F\",0,($AQ$15/10)*AO18))","v":15},{"$f":"'1ERPA'!AM18","v":100},{"$f":"'1ERPA'!AO18","v":9},{"$f":"'1ERPA'!AQ18","v":22.5},{"$f":"'2DOPA'!AM18","v":100},{"$f":"'2DOPA'!AO18","v":10},{"$f":"'2DOPA'!AQ18","v":25},{"$f":"IF(AM18=\"\",\"\",AVERAGE(AM18,AR18,AU18))","v":100},{"$f":"IF(AO18=\"\",\"\",AVERAGE(AO18,AS18,AV18))","v":7.333333333333333},{"$f":"IF(AQ18=\"\",\"\",SUM(AQ18,AT18,AW18))","v":62.5}]
[{"$f":"IF(F19=\"\",\"\",A18+1)","v":3},3,0,1,{"$f":"IF(B19=\"SD/F\",E18+1,IF(B19<6,E18+1,E18))","v":3},{"$f":"IF('1ERPA'!F19=\"\",\"\",'1ERPA'!F19)","v":"LA MADRID GONZALEZ FERNANDA ISABEL "},"A","A","A","A","A",null,null,null,null,null,null,null,null,null,null,null,null,null,null,null,null,null,null,null,null,null,null,null,null,null,5,0,100,{"$f":"IF('3ERPM'!W22=\"\",\"\",IF('3ERPM'!W22=0,\"\",('3ERPM'!W22)*100))","v":29.500000000000004},3,"TRES",15,{"$f":"'1ERPA'!AM19","v":100},{"$f":"'1ERPA'!AO19","v":8},{"$f":"'1ERPA'!AQ19","v":20},{"$f":"'2DOPA'!AM19","v":90},{"$f":"'2DOPA'!AO19","v":7},{"$f":"'2DOPA'!AQ19","v":17.5},96.666666666666671,6,52.5]
[{"$f":"IF(F20=\"\",\"\",A19+1)","v":4},{"$f":"AO20","v":3},{"$f":"IF(B20=\"SD/F\",1,0)","v":0},{"$f":"IF(B20<6,1,0)","v":1},{"$f":"IF(B20=\"SD/F\",E19+1,IF(B20<6,E19+1,E19))","v":4},{"$f":"IF('1ERPA'!F20=\"\",\"\",'1ERPA'!F20)","v":"LOPEZ CASTRO GLORIA KARINA"},"A","A","A","A","A",null,null,null,null,null,null,null,null,null,null,null,null,null,null,null,null,null,null,null,null,null,null,null,null,null,5,0,100,{"$f":"IF('3ERPM'!W23=\"\",\"\",IF('3ERPM'!W23=0,\"\",('3ERPM'!W23)*100))","v":29.500000000000004},3,"TRES",15,{"$f":"'1ERPA'!AM20","v":100},{"$f":"'1ERPA'!AO20","v":9},{"$f":"'1ERPA'!AQ20","v":22.5},{"$f":"'2DOPA'!AM20","v":100},{"$f":"'2DOPA'!AO20","v":10},{"$f":"'2DOPA'!AQ20","v":25},100,7.333333333333333,62.5]
[5,3,0,1,{"$f":"IF(B21=\"SD/F\",E19+1,IF(B21<6,E19+1,E19))","v":4},{"$f":"IF('1ERPA'!F21=\"\",\"\",'1ERPA'!F21)","v":"GUZMAN SANTOS ALAN"},"A","A","A","A","A",null,null,null,null,null,null,null,null,null,null,null,null,null,null,null,null,null,null,null,null,null,null,null,null,null,5,0,100,{"$f":"IF('3ERPM'!W24=\"\",\"\",IF('3ERPM'!W24=0,\"\",('3ERPM'!W24)*100))","v":29.500000000000004},3,"TRES",15,{"$f":"'1ERPA'!AM21","v":100},{"$f":"'1ERPA'!AO21","v":9},{"$f":"'1ERPA'!AQ21","v":22.5},{"$f":"'2DOPA'!AM21","v":100},{"$f":"'2DOPA'!AO21","v":10},{"$f":"'2DOPA'!AQ21","v":25},100,7.333333333333333,62.5]
[6,{"$f":"AO22","v":3},{"$f":"IF(B22=\"SD/F\",1,0)","v":0},{"$f":"IF(B22<6,1,0)","v":1},{"$f":"IF(B22=\"SD/F\",E21+1,IF(B22<6,E21+1,E21))","v":5},{"$f":"IF('1ERPA'!F22=\"\",\"\",'1ERPA'!F22)","v":"Y"},"A","A","A","A","A",null,null,null,null,null,null,null,null,null,null,null,null,null,null,null,null,null,null,null,null,null,null,null,null,null,5,0,100,{"$f":"IF('3ERPM'!W25=\"\",\"\",IF('3ERPM'!W25=0,\"\",('3ERPM'!W25)*100))","v":29.500000000000004},3,"TRES",15,{"$f":"'1ERPA'!AM22","v":100},{"$f":"'1ERPA'!AO22","v":9},{"$f":"'1ERPA'!AQ22","v":22.5},{"$f":"'2DOPA'!AM22","v":100},{"$f":"'2DOPA'!AO22","v":10},{"$f":"'2DOPA'!AQ22","v":25},100,7.333333333333333,62.5]
[7,3,0,1,{"$f":"IF(B23=\"SD/F\",E21+1,IF(B23<6,E21+1,E21))","v":5},{"$f":"IF('1ERPA'!F23=\"\",\"\",'1ERPA'!F23)","v":"U"},"A","A","A","A","A",null,null,null,null,null,null,null,null,null,null,null,null,null,null,null,null,null,null,null,null,null,null,null,null,null,5,0,100,{"$f":"IF('3ERPM'!W26=\"\",\"\",IF('3ERPM'!W26=0,\"\",('3ERPM'!W26)*100))","v":29.500000000000004},3,"TRES",15,{"$f":"'1ERPA'!AM23","v":100},{"$f":"'1ERPA'!AO23","v":9},{"$f":"'1ERPA'!AQ23","v":22.5},{"$f":"'2DOPA'!AM23","v":100},{"$f":"'2DOPA'!AO23","v":10},{"$f":"'2DOPA'!AQ23","v":25},100,7.333333333333333,62.5]
[8,3,0,1,6,{"$f":"IF('1ERPA'!F24=\"\",\"\",'1ERPA'!F24)","v":"ILLAN MONJARDIN JOSE LUIS"},"A","A","A","A","A",null,null,null,null,null,null,null,null,null,null,null,null,null,null,null,null,null,null,null,null,null,null,null,null,null,5,0,100,{"$f":"IF('3ERPM'!W27=\"\",\"\",IF('3ERPM'!W27=0,\"\",('3ERPM'!W27)*100))","v":29.500000000000004},3,"TRES",15,{"$f":"'1ERPA'!AM24","v":93.75},{"$f":"'1ERPA'!AO24","v":9},{"$f":"'1ERPA'!AQ24","v":22.5},{"$f":"'2DOPA'!AM24","v":100},{"$f":"'2DOPA'!AO24","v":10},{"$f":"'2DOPA'!AQ24","v":25},97.916666666666671,7.333333333333333,62.5]
[{"$f":"IF(F25=\"\",\"\",A24+1)","v":9},{"$f":"AO25","v":6},{"$f":"IF(B25=\"SD/F\",1,0)","v":0},{"$f":"IF(B25<6,1,0)","v":0},{"$f":"IF(B25=\"SD/F\",E24+1,IF(B25<6,E24+1,E24))","v":6},{"$f":"IF('1ERPA'!F25=\"\",\"\",'1ERPA'!F25)","v":"e"},"A","A","A","A","A",null,null,null,null,null,null,null,null,null,null,null,null,null,null,null,null,null,null,null,null,null,null,null,null,null,{"$f":"IF(G25=\"\",\"\",COUNTIF(G25:AJ25,\"A\")+COUNTIF(G25:AJ25,\"J\"))","v":5},{"$f":"IF(AK25=\"\",\"\",COUNTIF(G25:AJ25,\"F\"))","v":0},{"$f":"IF(AK25=\"\",\"\",($AK$15-AL25)*$AM$15)","v":100},{"$f":"IF('3ERPM'!W28=\"\",\"\",IF('3ERPM'!W28=0,\"\",('3ERPM'!W28)*100))","v":56.000000000000007},{"$f":"IF(AM25<80,\"SD/F\",IF(AN25=\"\",\"\",IF(AN25>=96,10,IF(AN25>=86,9,IF(AN25>=76,8,IF(AN25>=66,7,IF(AN25>=56,6,IF(AN25>=46,5,IF(AN25>=36,4,IF(AN25>=26,3,IF(AN25>=16,2,IF(AN25>=6,1,IF(AN25>=0,0,\"\")))))))))))))","v":6},{"$f":"IF(AM25<80,\"SD/F\",IF(AO25=\"\",\"\",IF(AO25>=9.6,\"DIEZ\",IF(AO25>=8.6,\"NUEVE\",IF(AO25>=7.6,\"OCHO\",IF(AO25>=6.6,\"SIETE\",IF(AO25>=5.6,\"SEIS\",IF(AO25>=4.6,\"CINCO\",IF(AO25>=3.6,\"CUATRO\",IF(AO25>=2.6,\"TRES\",IF(AO25>=1.6,\"DOS\",IF(AO25>=0.6,\"UNO\",IF(AO25>=0,\"CERO\",\"\")))))))))))))","v":"SEIS"},{"$f":"IF(AP25=\"\",\"\",IF(AP25=\"SD/F\",0,($AQ$15/10)*AO25))","v":30},{"$f":"'1ERPA'!AM25","v":93.75},{"$f":"'1ERPA'!AO25","v":9},{"$f":"'1ERPA'!AQ25","v":22.5},{"$f":"'2DOPA'!AM25","v":100},{"$f":"'2DOPA'!AO25","v":10},{"$f":"'2DOPA'!AQ25","v":25},{"$f":"IF(AM25=\"\",\"\",AVERAGE(AM25,AR25,AU25))","v":97.916666666666671},{"$f":"IF(AO25=\"\",\"\",AVERAGE(AO25,AS25,AV25))","v":8.3333333333333339},{"$f":"IF(AQ25=\"\",\"\",SUM(AQ25,AT25,AW25))","v":77.5}]
[10,8,0,0,6,{"$f":"IF('1ERPA'!F26=\"\",\"\",'1ERPA'!F26)","v":"f"},"A","A","A","A","A",null,null,null,null,null,null,null,null,null,null,null,null,null,null,null,null,null,null,null,null,null,null,null,null,null,5,0,100,{"$f":"IF('3ERPM'!W29=\"\",\"\",IF('3ERPM'!W29=0,\"\",('3ERPM'!W29)*100))","v":82.5},8,"OCHO",40,{"$f":"'1ERPA'!AM26","v":93.75},{"$f":"'1ERPA'!AO26","v":9},{"$f":"'1ERPA'!AQ26","v":22.5},{"$f":"'2DOPA'!AM26","v":100},{"$f":"'2DOPA'!AO26","v":10},{"$f":"'2DOPA'!AQ26","v":25},97.916666666666671,9,87.5]
[11,10,0,0,6,{"$f":"IF('1ERPA'!F27=\"\",\"\",'1ERPA'!F27)","v":"GUZMAN SANTOS ALAN"},"A","A","A","A","A",null,null,null,null,null,null,null,null,null,null,null,null,null,null,null,null,null,null,null,null,null,null,null,null,null,5,0,100,{"$f":"IF('3ERPM'!W30=\"\",\"\",IF('3ERPM'!W30=0,\"\",('3ERPM'!W30)*100))","v":109.00000000000001},10,"DIEZ",50,{"$f":"'1ERPA'!AM27","v":93.75},{"$f":"'1ERPA'!AO27","v":9},{"$f":"'1ERPA'!AQ27","v":22.5},{"$f":"'2DOPA'!AM27","v":100},{"$f":"'2DOPA'!AO27","v":10},{"$f":"'2DOPA'!AQ27","v":25},97.916666666666671,9.6666666666666661,97.5]
[12,10,0,0,6,{"$f":"IF('1ERPA'!F28=\"\",\"\",'1ERPA'!F28)","v":"h"},"A","A","A","A","A",null,null,null,null,null,null,null,null,null,null,null,null,null,null,null,null,null,null,null,null,null,null,null,null,null,5,0,100,{"$f":"IF('3ERPM'!W31=\"\",\"\",IF('3ERPM'!W31=0,\"\",('3ERPM'!W31)*100))","v":135.5},10,"DIEZ",50,{"$f":"'1ERPA'!AM28","v":93.75},{"$f":"'1ERPA'!AO28","v":9},{"$f":"'1ERPA'!AQ28","v":22.5},{"$f":"'2DOPA'!AM28","v":100},{"$f":"'2DOPA'!AO28","v":10},{"$f":"'2DOPA'!AQ28","v":25},97.916666666666671,9.6666666666666661,97.5]
[13,10,0,0,6,{"$f":"IF('1ERPA'!F29=\"\",\"\",'1ERPA'!F29)","v":"ILLAN MONJARDIN JOSE LUIS"},"A","A","A","A","A",null,null,null,null,null,null,null,null,null,null,null,null,null,null,null,null,null,null,null,null,null,null,null,null,null,5,0,100,{"$f":"IF('3ERPM'!W32=\"\",\"\",IF('3ERPM'!W32=0,\"\",('3ERPM'!W32)*100))","v":162},10,"DIEZ",50,{"$f":"'1ERPA'!AM29","v":81.25},{"$f":"'1ERPA'!AO29","v":9},{"$f":"'1ERPA'!AQ29","v":22.5},{"$f":"'2DOPA'!AM29","v":100},{"$f":"'2DOPA'!AO29","v":10},{"$f":"'2DOPA'!AQ29","v":25},93.75,9.6666666666666661,97.5]
[14,"",0,0,6,{"$f":"IF('1ERPA'!F30=\"\",\"\",'1ERPA'!F30)","v":"T"},null,null,null,null,null,null,null,null,null,null,null,null,null,null,null,null,null,null,null,null,null,null,null,null,null,null,null,null,null,null,"","","",{"$f":"IF('3ERPM'!W33=\"\",\"\",IF('3ERPM'!W33=0,\"\",('3ERPM'!W33)*100))","v":""},"","","",{"$f":"'1ERPA'!AM30","v":100},{"$f":"'1ERPA'!AO30","v":9},{"$f":"'1ERPA'!AQ30","v":22.5},{"$f":"'2DOPA'!AM30","v":""},{"$f":"'2DOPA'!AO30","v":10},{"$f":"'2DOPA'!AQ30","v":25},"","",""]
["","",0,0,6,{"$f":"IF('1ERPA'!F31=\"\",\"\",'1ERPA'!F31)","v":""},null,null,null,null,null,null,null,null,null,null,null,null,null,null,null,null,null,null,null,null,null,null,null,null,null,null,null,null,null,null,"","","",{"$f":"IF('3ERPM'!W34=\"\",\"\",IF('3ERPM'!W34=0,\"\",('3ERPM'!W34)*100))","v":""},"","","",{"$f":"'1ERPA'!AM31","v":""},{"$f":"'1ERPA'!AO31","v":""},{"$f":"'1ERPA'!AQ31","v":""},{"$f":"'2DOPA'!AM31","v":""},{"$f":"'2DOPA'!AO31","v":""},{"$f":"'2DOPA'!AQ31","v":""},"","",""]
["","",0,0,6,{"$f":"IF('1ERPA'!F32=\"\",\"\",'1ERPA'!F32)","v":""},null,null,null,null,null,null,null,null,null,null,null,null,null,null,null,null,null,null,null,null,null,null,null,null,null,null,null,null,null,null,"","","",{"$f":"IF('3ERPM'!W35=\"\",\"\",IF('3ERPM'!W35=0,\"\",('3ERPM'!W35)*100))","v":""},"","","",{"$f":"'1ERPA'!AM32","v":""},{"$f":"'1ERPA'!AO32","v":""},{"$f":"'1ERPA'!AQ32","v":""},{"$f":"'2DOPA'!AM32","v":""},{"$f":"'2DOPA'!AO32","v":""},{"$f":"'2DOPA'!AQ32","v":""},"","",""]
["","",0,0,6,{"$f":"IF('1ERPA'!F33=\"\",\"\",'1ERPA'!F33)","v":""},null,null,null,null,null,null,null,null,null,null,null,null,null,null,null,null,null,null,null,null,null,null,null,null,null,null,null,null,null,null,"","","",{"$f":"IF('3ERPM'!W36=\"\",\"\",IF('3ERPM'!W36=0,\"\",('3ERPM'!W36)*100))","v":""},"","","",{"$f":"'1ERPA'!AM33","v":""},{"$f":"'1ERPA'!AO33","v":""},{"$f":"'1ERPA'!AQ33","v":""},{"$f":"'2DOPA'!AM33","v":""},{"$f":"'2DOPA'!AO33","v":""},{"$f":"'2DOPA'!AQ33","v":""},"","",""]
["","",0,0,6,{"$f":"IF('1ERPA'!F34=\"\",\"\",'1ERPA'!F34)","v":""},null,null,null,null,null,null,null,null,null,null,null,null,null,null,null,null,null,null,null,null,null,null,null,null,null,null,null,null,null,null,"","","",{"$f":"IF('3ERPM'!W37=\"\",\"\",IF('3ERPM'!W37=0,\"\",('3ERPM'!W37)*100))","v":""},"","","",{"$f":"'1ERPA'!AM34","v":""},{"$f":"'1ERPA'!AO34","v":""},{"$f":"'1ERPA'!AQ34","v":""},{"$f":"'2DOPA'!AM34","v":""},{"$f":"'2DOPA'!AO34","v":""},{"$f":"'2DOPA'!AQ34","v":""},"","",""]
["","",0,0,6,{"$f":"IF('1ERPA'!F35=\"\",\"\",'1ERPA'!F35)","v":""},null,null,null,null,null,null,null,null,null,null,null,null,null,null,null,null,null,null,null,null,null,null,null,null,null,null,null,null,null,null,"","","",{"$f":"IF('3ERPM'!W38=\"\",\"\",IF('3ERPM'!W38=0,\"\",('3ERPM'!W38)*100))","v":""},"","","",{"$f":"'1ERPA'!AM35","v":""},{"$f":"'1ERPA'!AO35","v":""},{"$f":"'1ERPA'!AQ35","v":""},{"$f":"'2DOPA'!AM35","v":""},{"$f":"'2DOPA'!AO35","v":""},{"$f":"'2DOPA'!AQ35","v":""},"","",""]
["","",0,0,6,{"$f":"IF('1ERPA'!F36=\"\",\"\",'1ERPA'!F36)","v":""},null,null,null,null,null,null,null,null,null,null,null,null,null,null,null,null,null,null,null,null,null,null,null,null,null,null,null,null,null,null,"","","",{"$f":"IF('3ERPM'!W39=\"\",\"\",IF('3ERPM'!W39=0,\"\",('3ERPM'!W39)*100))","v":""},"","","",{"$f":"'1ERPA'!AM36","v":""},{"$f":"'1ERPA'!AO36","v":""},{"$f":"'1ERPA'!AQ36","v":""},{"$f":"'2DOPA'!AM36","v":""},{"$f":"'2DOPA'!AO36","v":""},{"$f":"'2DOPA'!AQ36","v":""},"","",""]
["","",0,0,6,{"$f":"IF('1ERPA'!F37=\"\",\"\",'1ERPA'!F37)","v":""},null,null,null,null,null,null,null,null,null,null,null,null,null,null,null,null,null,null,null,null,null,null,null,null,null,null,null,null,null,null,"","","",{"$f":"IF('3ERPM'!W40=\"\",\"\",IF('3ERPM'!W40=0,\"\",('3ERPM'!W40)*100))","v":""},"","","",{"$f":"'1ERPA'!AM37","v":""},{"$f":"'1ERPA'!AO37","v":""},{"$f":"'1ERPA'!AQ37","v":""},{"$f":"'2DOPA'!AM37","v":""},{"$f":"'2DOPA'!AO37","v":""},{"$f":"'2DOPA'!AQ37","v":""},"","",""]
["","",0,0,6,{"$f":"IF('1ERPA'!F38=\"\",\"\",'1ERPA'!F38)","v":""},null,null,null,null,null,null,null,null,null,null,null,null,null,null,null,null,null,null,null,null,null,null,null,null,null,null,null,null,null,null,"","","",{"$f":"IF('3ERPM'!W41=\"\",\"\",IF('3ERPM'!W41=0,\"\",('3ERPM'!W41)*100))","v":""},"","","",{"$f":"'1ERPA'!AM38","v":""},{"$f":"'1ERPA'!AO38","v":""},{"$f":"'1ERPA'!AQ38","v":""},{"$f":"'2DOPA'!AM38","v":""},{"$f":"'2DOPA'!AO38","v":""},{"$f":"'2DOPA'!AQ38","v":""},"","",""]
["","",0,0,6,{"$f":"IF('1ERPA'!F39=\"\",\"\",'1ERPA'!F39)","v":""},null,null,null,null,null,null,null,null,null,null,null,null,null,null,null,null,null,null,null,null,null,null,null,null,null,null,null,null,null,null,"","","",{"$f":"IF('3ERPM'!W42=\"\",\"\",IF('3ERPM'!W42=0,\"\",('3ERPM'!W42)*100))","v":""},"","","",{"$f":"'1ERPA'!AM39","v":""},{"$f":"'1ERPA'!AO39","v":""},{"$f":"'1ERPA'!AQ39","v":""},{"$f":"'2DOPA'!AM39","v":""},{"$f":"'2DOPA'!AO39","v":""},{"$f":"'2DOPA'!AQ39","v":""},"","",""]
["","",0,0,6,{"$f":"IF('1ERPA'!F40=\"\",\"\",'1ERPA'!F40)","v":""},null,null,null,null,null,null,null,null,null,null,null,null,null,null,null,null,null,null,null,null,null,null,null,null,null,null,null,null,null,null,"","","",{"$f":"IF('3ERPM'!W43=\"\",\"\",IF('3ERPM'!W43=0,\"\",('3ERPM'!W43)*100))","v":""},"","","",{"$f":"'1ERPA'!AM40","v":""},{"$f":"'1ERPA'!AO40","v":""},{"$f":"'1ERPA'!AQ40","v":""},{"$f":"'2DOPA'!AM40","v":""},{"$f":"'2DOPA'!AO40","v":""},{"$f":"'2DOPA'!AQ40","v":""},"","",""]
["","",0,0,6,{"$f":"IF('1ERPA'!F41=\"\",\"\",'1ERPA'!F41)","v":""},null,null,null,null,null,null,null,null,null,null,null,null,null,null,null,null,null,null,null,null,null,null,null,null,null,null,null,null,null,null,"","","",{"$f":"IF('3ERPM'!W44=\"\",\"\",IF('3ERPM'!W44=0,\"\",('3ERPM'!W44)*100))","v":""},"","","",{"$f":"'1ERPA'!AM41","v":""},{"$f":"'1ERPA'!AO41","v":""},{"$f":"'1ERPA'!AQ41","v":""},{"$f":"'2DOPA'!AM41","v":""},{"$f":"'2DOPA'!AO41","v":""},{"$f":"'2DOPA'!AQ41","v":""},"","",""]
["","",0,0,6,{"$f":"IF('1ERPA'!F42=\"\",\"\",'1ERPA'!F42)","v":""},null,null,null,null,null,null,null,null,null,null,null,null,null,null,null,null,null,null,null,null,null,null,null,null,null,null,null,null,null,null,"","","",{"$f":"IF('3ERPM'!W45=\"\",\"\",IF('3ERPM'!W45=0,\"\",('3ERPM'!W45)*100))","v":""},"","","",{"$f":"'1ERPA'!AM42","v":""},{"$f":"'1ERPA'!AO42","v":""},{"$f":"'1ERPA'!AQ42","v":""},{"$f":"'2DOPA'!AM42","v":""},{"$f":"'2DOPA'!AO42","v":""},{"$f":"'2DOPA'!AQ42","v":""},"","",""]
["","",0,0,6,{"$f":"IF('1ERPA'!F43=\"\",\"\",'1ERPA'!F43)","v":""},null,null,null,null,null,null,null,null,null,null,null,null,null,null,null,null,null,null,null,null,null,null,null,null,null,null,null,null,null,null,"","","",{"$f":"IF('3ERPM'!W46=\"\",\"\",IF('3ERPM'!W46=0,\"\",('3ERPM'!W46)*100))","v":""},"","","",{"$f":"'1ERPA'!AM43","v":""},{"$f":"'1ERPA'!AO43","v":""},{"$f":"'1ERPA'!AQ43","v":""},{"$f":"'2DOPA'!AM43","v":""},{"$f":"'2DOPA'!AO43","v":""},{"$f":"'2DOPA'!AQ43","v":""},"","",""]
["","",0,0,6,{"$f":"IF('1ERPA'!F44=\"\",\"\",'1ERPA'!F44)","v":""},null,null,null,null,null,null,null,null,null,null,null,null,null,null,null,null,null,null,null,null,null,null,null,null,null,null,null,null,null,null,"","","",{"$f":"IF('3ERPM'!W47=\"\",\"\",IF('3ERPM'!W47=0,\"\",('3ERPM'!W47)*100))","v":""},"","","",{"$f":"'1ERPA'!AM44","v":""},{"$f":"'1ERPA'!AO44","v":""},{"$f":"'1ERPA'!AQ44","v":""},{"$f":"'2DOPA'!AM44","v":""},{"$f":"'2DOPA'!AO44","v":""},{"$f":"'2DOPA'!AQ44","v":""},"","",""]
["","",0,0,6,{"$f":"IF('1ERPA'!F45=\"\",\"\",'1ERPA'!F45)","v":""},null,null,null,null,null,null,null,null,null,null,null,null,null,null,null,null,null,null,null,null,null,null,null,null,null,null,null,null,null,null,"","","",{"$f":"IF('3ERPM'!W48=\"\",\"\",IF('3ERPM'!W48=0,\"\",('3ERPM'!W48)*100))","v":""},"","","",{"$f":"'1ERPA'!AM45","v":""},{"$f":"'1ERPA'!AO45","v":""},{"$f":"'1ERPA'!AQ45","v":""},{"$f":"'2DOPA'!AM45","v":""},{"$f":"'2DOPA'!AO45","v":""},{"$f":"'2DOPA'!AQ45","v":""},"","",""]
["","",0,0,6,{"$f":"IF('1ERPA'!F46=\"\",\"\",'1ERPA'!F46)","v":""},null,null,null,null,null,null,null,null,null,null,null,null,null,null,null,null,null,null,null,null,null,null,null,null,null,null,null,null,null,null,"","","",{"$f":"IF('3ERPM'!W49=\"\",\"\",IF('3ERPM'!W49=0,\"\",('3ERPM'!W49)*100))","v":""},"","","",{"$f":"'1ERPA'!AM46","v":""},{"$f":"'1ERPA'!AO46","v":""},{"$f":"'1ERPA'!AQ46","v":""},{"$f":"'2DOPA'!AM46","v":""},{"$f":"'2DOPA'!AO46","v":""},{"$f":"'2DOPA'!AQ46","v":""},"","",""]
["","",0,0,6,{"$f":"IF('1ERPA'!F47=\"\",\"\",'1ERPA'!F47)","v":""},null,null,null,null,null,null,null,null,null,null,null,null,null,null,null,null,null,null,null,null,null,null,null,null,null,null,null,null,null,null,"","","",{"$f":"IF('3ERPM'!W50=\"\",\"\",IF('3ERPM'!W50=0,\"\",('3ERPM'!W50)*100))","v":""},"","","",{"$f":"'1ERPA'!AM47","v":""},{"$f":"'1ERPA'!AO47","v":""},{"$f":"'1ERPA'!AQ47","v":""},{"$f":"'2DOPA'!AM47","v":""},{"$f":"'2DOPA'!AO47","v":""},{"$f":"'2DOPA'!AQ47","v":""},"","",""]
["","",0,0,6,{"$f":"IF('1ERPA'!F48=\"\",\"\",'1ERPA'!F48)","v":""},null,null,null,null,null,null,null,null,null,null,null,null,null,null,null,null,null,null,null,null,null,null,null,null,null,null,null,null,null,null,"","","",{"$f":"IF('3ERPM'!W51=\"\",\"\",IF('3ERPM'!W51=0,\"\",('3ERPM'!W51)*100))","v":""},"","","",{"$f":"'1ERPA'!AM48","v":""},{"$f":"'1ERPA'!AO48","v":""},{"$f":"'1ERPA'!AQ48","v":""},{"$f":"'2DOPA'!AM48","v":""},{"$f":"'2DOPA'!AO48","v":""},{"$f":"'2DOPA'!AQ48","v":""},"","",""]
["","",0,0,6,{"$f":"IF('1ERPA'!F49=\"\",\"\",'1ERPA'!F49)","v":""},null,null,null,null,null,null,null,null,null,null,null,null,null,null,null,null,null,null,null,null,null,null,null,null,null,null,null,null,null,null,"","","",{"$f":"IF('3ERPM'!W52=\"\",\"\",IF('3ERPM'!W52=0,\"\",('3ERPM'!W52)*100))","v":""},"","","",{"$f":"'1ERPA'!AM49","v":""},{"$f":"'1ERPA'!AO49","v":""},{"$f":"'1ERPA'!AQ49","v":""},{"$f":"'2DOPA'!AM49","v":""},{"$f":"'2DOPA'!AO49","v":""},{"$f":"'2DOPA'!AQ49","v":""},"","",""]
["","",0,0,6,{"$f":"IF('1ERPA'!F50=\"\",\"\",'1ERPA'!F50)","v":""},null,null,null,null,null,null,null,null,null,null,null,null,null,null,null,null,null,null,null,null,null,null,null,null,null,null,null,null,null,null,"","","",{"$f":"IF('3ERPM'!W53=\"\",\"\",IF('3ERPM'!W53=0,\"\",('3ERPM'!W53)*100))","v":""},"","","",{"$f":"'1ERPA'!AM50","v":""},{"$f":"'1ERPA'!AO50","v":""},{"$f":"'1ERPA'!AQ50","v":""},{"$f":"'2DOPA'!AM50","v":""},{"$f":"'2DOPA'!AO50","v":""},{"$f":"'2DOPA'!AQ50","v":""},"","",""]
["","",0,0,6,{"$f":"IF('1ERPA'!F51=\"\",\"\",'1ERPA'!F51)","v":""},null,null,null,null,null,null,null,null,null,null,null,null,null,null,null,null,null,null,null,null,null,null,null,null,null,null,null,null,null,null,"","","",{"$f":"IF('3ERPM'!W54=\"\",\"\",IF('3ERPM'!W54=0,\"\",('3ERPM'!W54)*100))","v":""},"","","",{"$f":"'1ERPA'!AM51","v":""},{"$f":"'1ERPA'!AO51","v":""},{"$f":"'1ERPA'!AQ51","v":""},{"$f":"'2DOPA'!AM51","v":""},{"$f":"'2DOPA'!AO51","v":""},{"$f":"'2DOPA'!AQ51","v":""},"","",""]
["","",0,0,6,{"$f":"IF('1ERPA'!F52=\"\",\"\",'1ERPA'!F52)","v":""},null,null,null,null,null,null,null,null,null,null,null,null,null,null,null,null,null,null,null,null,null,null,null,null,null,null,null,null,null,null,"","","",{"$f":"IF('3ERPM'!W55=\"\",\"\",IF('3ERPM'!W55=0,\"\",('3ERPM'!W55)*100))","v":""},"","","",{"$f":"'1ERPA'!AM52","v":""},{"$f":"'1ERPA'!AO52","v":""},{"$f":"'1ERPA'!AQ52","v":""},{"$f":"'2DOPA'!AM52","v":""},{"$f":"'2DOPA'!AO52","v":""},{"$f":"'2DOPA'!AQ52","v":""},"","",""]
["","",0,0,6,{"$f":"IF('1ERPA'!F53=\"\",\"\",'1ERPA'!F53)","v":""},null,null,null,null,null,null,null,null,null,null,null,null,null,null,null,null,null,null,null,null,null,null,null,null,null,null,null,null,null,null,"","","",{"$f":"IF('3ERPM'!W56=\"\",\"\",IF('3ERPM'!W56=0,\"\",('3ERPM'!W56)*100))","v":""},"","","",{"$f":"'1ERPA'!AM53","v":""},{"$f":"'1ERPA'!AO53","v":""},{"$f":"'1ERPA'!AQ53","v":""},{"$f":"'2DOPA'!AM53","v":""},{"$f":"'2DOPA'!AO53","v":""},{"$f":"'2DOPA'!AQ53","v":""},"","",""]
["","",0,0,6,{"$f":"IF('1ERPA'!F54=\"\",\"\",'1ERPA'!F54)","v":""},null,null,null,null,null,null,null,null,null,null,null,null,null,null,null,null,null,null,null,null,null,null,null,null,null,null,null,null,null,null,"","","",{"$f":"IF('3ERPM'!W57=\"\",\"\",IF('3ERPM'!W57=0,\"\",('3ERPM'!W57)*100))","v":""},"","","",{"$f":"'1ERPA'!AM54","v":""},{"$f":"'1ERPA'!AO54","v":""},{"$f":"'1ERPA'!AQ54","v":""},{"$f":"'2DOPA'!AM54","v":""},{"$f":"'2DOPA'!AO54","v":""},{"$f":"'2DOPA'!AQ54","v":""},"","",""]
["","",0,0,6,{"$f":"IF('1ERPA'!F55=\"\",\"\",'1ERPA'!F55)","v":""},null,null,null,null,null,null,null,null,null,null,null,null,null,null,null,null,null,null,null,null,null,null,null,null,null,null,null,null,null,null,"","","",{"$f":"IF('3ERPM'!W58=\"\",\"\",IF('3ERPM'!W58=0,\"\",('3ERPM'!W58)*100))","v":""},"","","",{"$f":"'1ERPA'!AM55","v":""},{"$f":"'1ERPA'!AO55","v":""},{"$f":"'1ERPA'!AQ55","v":""},{"$f":"'2DOPA'!AM55","v":""},{"$f":"'2DOPA'!AO55","v":""},{"$f":"'2DOPA'!AQ55","v":""},"","",""]
["","",0,0,6,{"$f":"IF('1ERPA'!F56=\"\",\"\",'1ERPA'!F56)","v":""},null,null,null,null,null,null,null,null,null,null,null,null,null,null,null,null,null,null,null,null,null,null,null,null,null,null,null,null,null,null,"","","",{"$f":"IF('3ERPM'!W59=\"\",\"\",IF('3ERPM'!W59=0,\"\",('3ERPM'!W59)*100))","v":""},"","","",{"$f":"'1ERPA'!AM56","v":""},{"$f":"'1ERPA'!AO56","v":""},{"$f":"'1ERPA'!AQ56","v":""},{"$f":"'2DOPA'!AM56","v":""},{"$f":"'2DOPA'!AO56","v":""},{"$f":"'2DOPA'!AQ56","v":""},"","",""]
["","",0,0,6,{"$f":"IF('1ERPA'!F57=\"\",\"\",'1ERPA'!F57)","v":""},null,null,null,null,null,null,null,null,null,null,null,null,null,null,null,null,null,null,null,null,null,null,null,null,null,null,null,null,null,null,"","","",{"$f":"IF('3ERPM'!W60=\"\",\"\",IF('3ERPM'!W60=0,\"\",('3ERPM'!W60)*100))","v":""},"","","",{"$f":"'1ERPA'!AM57","v":""},{"$f":"'1ERPA'!AO57","v":""},{"$f":"'1ERPA'!AQ57","v":""},{"$f":"'2DOPA'!AM57","v":""},{"$f":"'2DOPA'!AO57","v":""},{"$f":"'2DOPA'!AQ57","v":""},"","",""]
["","",0,0,6,{"$f":"IF('1ERPA'!F58=\"\",\"\",'1ERPA'!F58)","v":""},null,null,null,null,null,null,null,null,null,null,null,null,null,null,null,null,null,null,null,null,null,null,null,null,null,null,null,null,null,null,"","","",{"$f":"IF('3ERPM'!W61=\"\",\"\",IF('3ERPM'!W61=0,\"\",('3ERPM'!W61)*100))","v":""},"","","",{"$f":"'1ERPA'!AM58","v":""},{"$f":"'1ERPA'!AO58","v":""},{"$f":"'1ERPA'!AQ58","v":""},{"$f":"'2DOPA'!AM58","v":""},{"$f":"'2DOPA'!AO58","v":""},{"$f":"'2DOPA'!AQ58","v":""},"","",""]
["","",0,0,6,{"$f":"IF('1ERPA'!F59=\"\",\"\",'1ERPA'!F59)","v":""},null,null,null,null,null,null,null,null,null,null,null,null,null,null,null,null,null,null,null,null,null,null,null,null,null,null,null,null,null,null,"","","",{"$f":"IF('3ERPM'!W62=\"\",\"\",IF('3ERPM'!W62=0,\"\",('3ERPM'!W62)*100))","v":""},"","","",{"$f":"'1ERPA'!AM59","v":""},{"$f":"'1ERPA'!AO59","v":""},{"$f":"'1ERPA'!AQ59","v":""},{"$f":"'2DOPA'!AM59","v":""},{"$f":"'2DOPA'!AO59","v":""},{"$f":"'2DOPA'!AQ59","v":""},"","",""]
["","",0,0,6,{"$f":"IF('1ERPA'!F60=\"\",\"\",'1ERPA'!F60)","v":""},null,null,null,null,null,null,null,null,null,null,null,null,null,null,null,null,null,null,null,null,null,null,null,null,null,null,null,null,null,null,"","","",{"$f":"IF('3ERPM'!W63=\"\",\"\",IF('3ERPM'!W63=0,\"\",('3ERPM'!W63)*100))","v":""},"","","",{"$f":"'1ERPA'!AM60","v":""},{"$f":"'1ERPA'!AO60","v":""},{"$f":"'1ERPA'!AQ60","v":""},{"$f":"'2DOPA'!AM60","v":""},{"$f":"'2DOPA'!AO60","v":""},{"$f":"'2DOPA'!AQ60","v":""},"","",""]
["","",0,0,6,{"$f":"IF('1ERPA'!F61=\"\",\"\",'1ERPA'!F61)","v":""},null,null,null,null,null,null,null,null,null,null,null,null,null,null,null,null,null,null,null,null,null,null,null,null,null,null,null,null,null,null,"","","",{"$f":"IF('3ERPM'!W64=\"\",\"\",IF('3ERPM'!W64=0,\"\",('3ERPM'!W64)*100))","v":""},"","","",{"$f":"'1ERPA'!AM61","v":""},{"$f":"'1ERPA'!AO61","v":""},{"$f":"'1ERPA'!AQ61","v":""},{"$f":"'2DOPA'!AM61","v":""},{"$f":"'2DOPA'!AO61","v":""},{"$f":"'2DOPA'!AQ61","v":""},"","",""]
["","",0,0,6,{"$f":"IF('1ERPA'!F62=\"\",\"\",'1ERPA'!F62)","v":""},null,null,null,null,null,null,null,null,null,null,null,null,null,null,null,null,null,null,null,null,null,null,null,null,null,null,null,null,null,null,"","","",{"$f":"IF('3ERPM'!W65=\"\",\"\",IF('3ERPM'!W65=0,\"\",('3ERPM'!W65)*100))","v":""},"","","",{"$f":"'1ERPA'!AM62","v":""},{"$f":"'1ERPA'!AO62","v":""},{"$f":"'1ERPA'!AQ62","v":""},{"$f":"'2DOPA'!AM62","v":""},{"$f":"'2DOPA'!AO62","v":""},{"$f":"'2DOPA'!AQ62","v":""},"","",""]
["","",0,0,6,{"$f":"IF('1ERPA'!F63=\"\",\"\",'1ERPA'!F63)","v":""},null,null,null,null,null,null,null,null,null,null,null,null,null,null,null,null,null,null,null,null,null,null,null,null,null,null,null,null,null,null,"","","",{"$f":"IF('3ERPM'!W66=\"\",\"\",IF('3ERPM'!W66=0,\"\",('3ERPM'!W66)*100))","v":""},"","","",{"$f":"'1ERPA'!AM63","v":""},{"$f":"'1ERPA'!AO63","v":""},{"$f":"'1ERPA'!AQ63","v":""},{"$f":"'2DOPA'!AM63","v":""},{"$f":"'2DOPA'!AO63","v":""},{"$f":"'2DOPA'!AQ63","v":""},"","",""]
["","",0,0,6,{"$f":"IF('1ERPA'!F64=\"\",\"\",'1ERPA'!F64)","v":""},null,null,null,null,null,null,null,null,null,null,null,null,null,null,null,null,null,null,null,null,null,null,null,null,null,null,null,null,null,null,"","","",{"$f":"IF('3ERPM'!W67=\"\",\"\",IF('3ERPM'!W67=0,\"\",('3ERPM'!W67)*100))","v":""},"","","",{"$f":"'1ERPA'!AM64","v":""},{"$f":"'1ERPA'!AO64","v":""},{"$f":"'1ERPA'!AQ64","v":""},{"$f":"'2DOPA'!AM64","v":""},{"$f":"'2DOPA'!AO64","v":""},{"$f":"'2DOPA'!AQ64","v":""},"","",""]
["","",0,0,6,{"$f":"IF('1ERPA'!F65=\"\",\"\",'1ERPA'!F65)","v":""},null,null,null,null,null,null,null,null,null,null,null,null,null,null,null,null,null,null,null,null,null,null,null,null,null,null,null,null,null,null,"","","",{"$f":"IF('3ERPM'!W68=\"\",\"\",IF('3ERPM'!W68=0,\"\",('3ERPM'!W68)*100))","v":""},"","","",{"$f":"'1ERPA'!AM65","v":""},{"$f":"'1ERPA'!AO65","v":""},{"$f":"'1ERPA'!AQ65","v":""},{"$f":"'2DOPA'!AM65","v":""},{"$f":"'2DOPA'!AO65","v":""},{"$f":"'2DOPA'!AQ65","v":""},"","",""]
["","",0,0,6,{"$f":"IF('1ERPA'!F66=\"\",\"\",'1ERPA'!F66)","v":""},null,null,null,null,null,null,null,null,null,null,null,null,null,null,null,null,null,null,null,null,null,null,null,null,null,null,null,null,null,null,"","","",{"$f":"IF('3ERPM'!W69=\"\",\"\",IF('3ERPM'!W69=0,\"\",('3ERPM'!W69)*100))","v":""},"","","",{"$f":"'1ERPA'!AM66","v":""},{"$f":"'1ERPA'!AO66","v":""},{"$f":"'1ERPA'!AQ66","v":""},{"$f":"'2DOPA'!AM66","v":""},{"$f":"'2DOPA'!AO66","v":""},{"$f":"'2DOPA'!AQ66","v":""},"","",""]
["","",0,0,6,{"$f":"IF('1ERPA'!F67=\"\",\"\",'1ERPA'!F67)","v":""},null,null,null,null,null,null,null,null,null,null,null,null,null,null,null,null,null,null,null,null,null,null,null,null,null,null,null,null,null,null,"","",{"$f":"IF(AK67=\"\",\"\",($AK$15-AL67)*$AM$15)","v":""},{"$f":"IF('3ERPM'!W70=\"\",\"\",IF('3ERPM'!W70=0,\"\",('3ERPM'!W70)*100))","v":""},{"$f":"IF(AM67<80,\"SD/F\",IF(AN67=\"\",\"\",IF(AN67>=96,10,IF(AN67>=86,9,IF(AN67>=76,8,IF(AN67>=66,7,IF(AN67>=56,6,IF(AN67>=46,5,IF(AN67>=36,4,IF(AN67>=26,3,IF(AN67>=16,2,IF(AN67>=6,1,IF(AN67>=0,0,\"\")))))))))))))","v":""},{"$f":"IF(AM67<80,\"SD/F\",IF(AO67=\"\",\"\",IF(AO67>=9.6,\"DIEZ\",IF(AO67>=8.6,\"NUEVE\",IF(AO67>=7.6,\"OCHO\",IF(AO67>=6.6,\"SIETE\",IF(AO67>=5.6,\"SEIS\",IF(AO67>=4.6,\"CINCO\",IF(AO67>=3.6,\"CUATRO\",IF(AO67>=2.6,\"TRES\",IF(AO67>=1.6,\"DOS\",IF(AO67>=0.6,\"UNO\",IF(AO67>=0,\"CERO\",\"\")))))))))))))","v":""},{"$f":"IF(AP67=\"\",\"\",IF(AP67=\"SD/F\",0,($AQ$15/10)*AO67))","v":""},{"$f":"'1ERPA'!AM67","v":0},{"$f":"'1ERPA'!AO67","v":0},{"$f":"'1ERPA'!AQ67","v":0},{"$f":"'2DOPA'!AM67","v":0},{"$f":"'2DOPA'!AO67","v":0},{"$f":"'2DOPA'!AQ67","v":0},{"$f":"IF(AM67=\"\",\"\",AVERAGE(AM67,AR67,AU67))","v":""},{"$f":"IF(AO67=\"\",\"\",AVERAGE(AO67,AS67,AV67))","v":""},{"$f":"IF(AQ67=\"\",\"\",SUM(AQ67,AT67,AW67))","v":""}]

{"sheet":"3ERPRE","index":7,"n_rows":47,"n_cols":39,"rows_kept":47,"cut":false,"hidden":false,"merged":[[39,1,39,40],[50,1,50,20],[50,21,50,40],[47,1,47,20],[47,21,47,40],[48,1,48,20],[48,21,48,40],[49,1,49,20],[49,21,49,40],[42,1,42,40],[43,1,43,40],[45,1,45,40],[46,1,46,20],[46,21,46,40],[41,1,41,40],[30,1,30,40],[31,1,31,20],[31,21,31,40],[40,1,40,40],[33,1,33,20],[33,21,33,40],[34,1,34,20],[34,21,34,40],[35,1,35,20],[35,21,35,40],[32,1,32,20],[32,21,32,40],[36,1,36,20],[36,21,36,40],[37,1,37,20],[37,21,37,40],[28,18,28,28],[21,4,21,6],[21,16,22,16],[21,17,22,17],[21,37,22,37],[22,4,22,6],[22,26,22,28],[22,34,22,36],[26,30,27,31],[26,32,27,32],[26,33,27,33],[26,34,27,36],[26,37,27,37],[17,2,19,8],[17,11,19,21],[17,24,19,30],[17,33,19,39],[26,38,27,39],[27,18,27,28],[21,38,22,38],[9,2,11,8],[9,11,11,21],[9,24,11,30],[9,33,11,39],[13,18,14,18],[13,19,14,19],[13,37,14,37],[13,38,14,38],[14,3,14,7],[14,13,14,17],[14,26,14,28],[14,34,14,36],[0,29,1,40],[2,31,2,40],[3,5,6,15],[5,26,5,27],[5,29,5,31],[5,34,5,39]]}
[null,null,null,null,null,null,null,null,null,null,null,null,null,null,null,null,null,null,null,null,null,null,null,null,null,null,null,null,null,{"$f":"IF('1ERPA'!M5=\"\",\"\",'1ERPA'!M5)","v":"Ingeniería en Sistemas Computacionales"}]
[]
[null,null,null,null,null,null,null,null,null,null,null,null,null,null,null,null,null,null,null,null,null,null,null,null,null,null,null,null,null,null,null,{"$f":"IF(MAX('1ERPA'!A17:A66)=0,\"\",MAX('1ERPA'!A17:A66))","v":14}]
[]
[]
[null,null,null,null,null,null,null,null,null,null,null,null,null,null,null,null,null,null,null,null,null,null,null,null,null,null,"ORD.",null,null,{"$f":"'1ERPA'!K7","v":"QUINTO"},null,null,{"$f":"IF('1ERPA'!Q7=\"\",\"\",'1ERPA'!Q7)","v":"A"},null,{"$f":"IF('1ERPA'!AD5=\"\",\"\",'1ERPA'!AD5)","v":"SEGURIDAD INFORMÁTICA Y DE REDES"}]
[]
[]
[]
[null,null,"PROMEDIO MENSUAL ASISTENCIA",null,null,null,null,null,null,null,null,"SUSTITUCIÓN",null,null,null,null,null,null,null,null,null,null,null,null,"PORCENTAJE DE APROBACIÓN",null,null,null,null,null,null,null,null,"SUSTITUCÓN"]
[]
[]
[]
[null,null,null,"AR","*","CI","-","F",null,null,null,null,null,{"$f":"AF3","v":14},"*",{"$f":"'3ERPA'!AK15","v":5},"-",{"$f":"'3ERPA'!AL15","v":0},"=",{"$f":"IF(N15=0,0,((N14*P14)-R14)/N15)","v":14},null,null,null,null,null,null,"AA","*",100,null,null,null,null,null,{"$f":"COUNTIF('3ERPA'!AO16:AO66,\">=6\")","v":5},"*",100,"=",{"$f":"IF(AI15=\"\",0,(AI14*AK14)/AI15)","v":35.714285714285715}]
[null,null,null,"CI",null,null,null,null,null,null,null,null,null,{"$f":"'3ERPA'!AK15","v":5},null,null,null,null,null,null,null,null,null,null,null,null,"AR",null,null,null,null,null,null,null,{"$f":"AF3","v":14}]
[]
[]
[null,null,"PROMEDIO DE EFICIENCIA",null,null,null,null,null,null,null,null,"SUSTITUCIÓN",null,null,null,null,null,null,null,null,null,null,null,null,"PORCENTAJE DE AVANCE PROGRAMÁTICO",null,null,null,null,null,null,null,null,"SUSTITUCÓN"]
[]
[]
[]
[null,null,null,null,"∑Cal",null,null,null,null,null,null,null,null,null,null,{"$f":"SUM('3ERPA'!AN17:AN67)/10","v":78.040000000000006},"=",{"$f":"IF(P23=\"\",0,P22/P23)","v":5.5742857142857147},null,null,null,null,null,null,null,null,"TI","*",100,null,null,null,null,null,2,"*",{"$f":"AC22","v":100},"=",{"$f":"IF(AI23=\"\",0,(AI22*AK22)/AI23)","v":100}]
[null,null,null,null,"AR",null,null,null,null,null,null,null,null,null,null,{"$f":"AF3","v":14},null,null,null,null,null,null,null,null,null,null,"TP",null,null,null,null,null,null,null,2]
[]
[]
[null,null,"SIMBOLOGÍA",null,null,null,null,null,null,null,"CI:","Número de clases impartidas"]
[null,null,"AR:","Cantidad de alumnos regulares",null,null,null,null,null,null,"AA:","Cantidad de alumnos aprobados",null,null,null,null,null,null,null,null,null,null,null,null,null,null,null,null,null,null,"PUEBLA,",null,17,"DE","JUNIO",null,null,"DE",2015]
[null,null,"F:","Faltas de alumnos en el periodo",null,null,null,null,null,null,"TI:","Temas impartidos",null,null,null,null,null,null,{"$f":"IF('1ERPA'!X10=\"\",\"\",'1ERPA'!X10)","v":"ALDO ORTEGA PACHECO"}]
[null,null,"Cal:","Calificaciones",null,null,null,null,null,null,"TP:","Temas programados",null,null,null,null,null,null,"NOMBRE Y FIRMA DEL CATEDRÁTICO",null,null,null,null,null,null,null,null,null,null,null,"SD/F"]
[]
[null,"ALUMNOS REPROBADOS Y CAUSA DE LA REPROBACIÓN"]
[null,"NOMBRE COMPLETO DEL ALUMNO",null,null,null,null,null,null,null,null,null,null,null,null,null,null,null,null,null,null,null,"CAUSA"]
[{"$f":"A32+1","v":1},{"$f":"IFERROR(VLOOKUP(A33,'3ERPA'!$E$17:$F$67,2,FALSE),\"\")","v":"GUZMAN SANTOS ALAN"},null,null,null,null,null,null,null,null,null,null,null,null,null,null,null,null,null,null,null,{"$f":"IF(B33=\"\",\"\",IF(IFERROR(VLOOKUP(B33,'3ERPA'!$F$17:$AO$67,36,FALSE),0)=$AE$29,\"SIN DERECHO POR FALTAS\",IF(VLOOKUP(B33,'3ERPM'!B20:Y69,22,FALSE)<0.3,IF(VLOOKUP(B33,'3ERPM'!B20:Y69,21,FALSE)<0.3,\"NO ENTREGO, LOS INDICADORES DE DESEMPEÑO Y EVIDENCIAS DE APRENDIZAJE NECESARIAS PARA APROBAR\",\"NO ENTREGO, LOS INDICADORES DE DESEMPEÑO NECESARIOS PARA APROBAR\"),\"NO ENTREGO, LAS EVIDENCIAS DE APRENDIZAJE NECESARIOS PARA APROBAR\")))","v":"NO ENTREGO, LOS INDICADORES DE DESEMPEÑO Y EVIDENCIAS DE APRENDIZAJE NECESARIAS PARA APROBAR"}]
[2,{"$f":"IFERROR(VLOOKUP(A34,'3ERPA'!$E$17:$F$67,2,FALSE),\"\")","v":"ILLAN MONJARDIN JOSE LUIS"},null,null,null,null,null,null,null,null,null,null,null,null,null,null,null,null,null,null,null,{"$f":"IF(B34=\"\",\"\",IF(IFERROR(VLOOKUP(B34,'3ERPA'!$F$17:$AO$67,36,FALSE),0)=$AE$29,\"SIN DERECHO POR FALTAS\",IF(VLOOKUP(B34,'3ERPM'!B21:Y70,22,FALSE)<0.3,IF(VLOOKUP(B34,'3ERPM'!B21:Y70,21,FALSE)<0.3,\"NO ENTREGO, LOS INDICADORES DE DESEMPEÑO Y EVIDENCIAS DE APRENDIZAJE NECESARIAS PARA APROBAR\",\"NO ENTREGO, LOS INDICADORES DE DESEMPEÑO NECESARIOS PARA APROBAR\"),\"NO ENTREGO, LAS EVIDENCIAS DE APRENDIZAJE NECESARIOS PARA APROBAR\")))","v":"NO ENTREGO, LOS INDICADORES DE DESEMPEÑO Y EVIDENCIAS DE APRENDIZAJE NECESARIAS PARA APROBAR"}]
[3,{"$f":"IFERROR(VLOOKUP(A35,'3ERPA'!$E$17:$F$67,2,FALSE),\"\")","v":"LA MADRID GONZALEZ FERNANDA ISABEL "},null,null,null,null,null,null,null,null,null,null,null,null,null,null,null,null,null,null,null,{"$f":"IF(B35=\"\",\"\",IF(IFERROR(VLOOKUP(B35,'3ERPA'!$F$17:$AO$67,36,FALSE),0)=$AE$29,\"SIN DERECHO POR FALTAS\",IF(VLOOKUP(B35,'3ERPM'!B22:Y71,22,FALSE)<0.3,IF(VLOOKUP(B35,'3ERPM'!B22:Y71,21,FALSE)<0.3,\"NO ENTREGO, LOS INDICADORES DE DESEMPEÑO Y EVIDENCIAS DE APRENDIZAJE NECESARIAS PARA APROBAR\",\"NO ENTREGO, LOS INDICADORES DE DESEMPEÑO NECESARIOS PARA APROBAR\"),\"NO ENTREGO, LAS EVIDENCIAS DE APRENDIZAJE NECESARIOS PARA APROBAR\")))","v":"NO ENTREGO, LOS INDICADORES DE DESEMPEÑO Y EVIDENCIAS DE APRENDIZAJE NECESARIAS PARA APROBAR"}]
[4,{"$f":"IFERROR(VLOOKUP(A36,'3ERPA'!$E$17:$F$67,2,FALSE),\"\")","v":"LOPEZ CASTRO GLORIA KARINA"},null,null,null,null,null,null,null,null,null,null,null,null,null,null,null,null,null,null,null,{"$f":"IF(B36=\"\",\"\",IF(IFERROR(VLOOKUP(B36,'3ERPA'!$F$17:$AO$67,36,FALSE),0)=$AE$29,\"SIN DERECHO POR FALTAS\",IF(VLOOKUP(B36,'3ERPM'!B24:Y72,22,FALSE)<0.3,IF(VLOOKUP(B36,'3ERPM'!B24:Y72,21,FALSE)<0.3,\"NO ENTREGO, LOS INDICADORES DE DESEMPEÑO Y EVIDENCIAS DE APRENDIZAJE NECESARIAS PARA APROBAR\",\"NO ENTREGO, LOS INDICADORES DE DESEMPEÑO NECESARIOS PARA APROBAR\"),\"NO ENTREGO, LAS EVIDENCIAS DE APRENDIZAJE NECESARIOS PARA APROBAR\")))","v":{"$error":"#N/A"}}]
[5,{"$f":"IFERROR(VLOOKUP(A37,'3ERPA'!$E$17:$F$67,2,FALSE),\"\")","v":"Y"},null,null,null,null,null,null,null,null,null,null,null,null,null,null,null,null,null,null,null,{"$f":"IF(B37=\"\",\"\",IF(IFERROR(VLOOKUP(B37,'3ERPA'!$F$17:$AO$67,36,FALSE),0)=$AE$29,\"SIN DERECHO POR FALTAS\",IF(VLOOKUP(B37,'3ERPM'!B25:Y73,22,FALSE)<0.3,IF(VLOOKUP(B37,'3ERPM'!B25:Y73,21,FALSE)<0.3,\"NO ENTREGO, LOS INDICADORES DE DESEMPEÑO Y EVIDENCIAS DE APRENDIZAJE NECESARIAS PARA APROBAR\",\"NO ENTREGO, LOS INDICADORES DE DESEMPEÑO NECESARIOS PARA APROBAR\"),\"NO ENTREGO, LAS EVIDENCIAS DE APRENDIZAJE NECESARIOS PARA APROBAR\")))","v":"NO ENTREGO, LOS INDICADORES DE DESEMPEÑO Y EVIDENCIAS DE APRENDIZAJE NECESARIAS PARA APROBAR"}]
[6,{"$f":"IF('3ERPA'!E16>6,\"Y \"&'3ERPA'!E16-5&\" MÁS REPROBADOS\",IFERROR(VLOOKUP(A38,'3ERPA'!$E$17:$F$67,2,FALSE),\"\"))","v":"Y 3 MÁS REPROBADOS"},null,null,null,null,null,null,null,null,null,null,null,null,null,null,null,null,null,null,null,{"$f":"IF(IFERROR(VLOOKUP(A38,'3ERPA'!$E$17:$F$67,2,FALSE),\"\")=B38,IF(B38=\"\",\"\",IF(IFERROR(VLOOKUP(B38,'3ERPA'!$F$17:$AO$67,36,FALSE),0)=$AE$29,\"SIN DERECHO POR FALTAS\",IF(VLOOKUP(B38,'3ERPM'!B26:Y74,22,FALSE)<0.3,IF(VLOOKUP(B38,'3ERPM'!B26:Y74,21,FALSE)<0.3,\"NO ENTREGO, LOS INDICADORES DE DESEMPEÑO Y EVIDENCIAS DE APRENDIZAJE NECESARIAS PARA APROBAR\",\"NO ENTREGO, LOS INDICADORES DE DESEMPEÑO NECESARIOS PARA APROBAR\"),\"NO ENTREGO, LAS EVIDENCIAS DE APRENDIZAJE NECESARIOS PARA APROBAR\"))),\"SIN DERECHO POR FALTAS Y/O POR NO ENTREGAR LAS EVIDENCIAS NECESARIAS\")","v":"SIN DERECHO POR FALTAS Y/O POR NO ENTREGAR LAS EVIDENCIAS NECESARIAS"}]
[null,null,null,null,null,null,null,null,null,null,null,null,null,null,null,null,null,null,null,null,null,null,null,null,null,null,null,null,{"$f":"IF('1ERPA'!$C$16<>0,\"CONTACTAR A LOS ALUMNOS PARA SABER QUE SUCEDE\",IF('1ERPA'!$D$16<>0,\"ASESORIAS PARA QUE MEJORE SU CALIFICACIÓN\",\"\"))","v":""}]
[null,"PROPUESTA DE SOLUCIÓN PARA REDUCIR EL PORCENTAJE DE REPROBACIÓN"]
[null,{"$f":"IF(AND('3ERPA'!C16>0,'3ERPA'!D16=0),\"CONTACTAR A LOS ALUMNOS PARA SABER QUE SUCEDE CON SUS ASISTENCIAS\",IF(AND('3ERPA'!C16=0,'3ERPA'!D16>0),\"ASESORIAS PARA QUE MEJOREN SUS CALIFICACIONES\",IF(AND('3ERPA'!C16>0,'3ERPA'!D16>0),\"ASESORIAS PARA QUE MEJOREN SUS CALIFICACIONES Y CONTACTAR A LOS ALUMNOS PARA SABER QUE SUCEDE CON SUS ASISTENCIAS\",\"\")))","v":"ASESORIAS PARA QUE MEJOREN SUS CALIFICACIONES"}]
[]
[]
[]
[]
[null,"TEMAS PENDIENTES DEL PERIODO QUE SE REPORTAN"]
[null,"TEMA(S)",null,null,null,null,null,null,null,null,null,null,null,null,null,null,null,null,null,null,null,"MOTIVO(S)"]

{"sheet":"3ERPM","index":8,"n_rows":69,"n_cols":25,"rows_kept":69,"cut":false,"hidden":false,"merged":[[3,20,3,21],[4,21,4,22],[0,4,2,22],[10,15,10,20],[11,15,11,20],[13,0,18,0],[13,1,18,1],[13,2,13,7],[13,8,14,17],[13,18,14,19],[15,16,16,17],[13,20,14,21],[13,22,18,22],[14,3,14,5],[15,2,17,2],[15,3,17,3],[15,4,17,4],[15,5,17,5],[15,6,17,6],[15,18,16,19],[15,20,18,20],[15,21,18,21],[15,7,17,7],[15,8,16,9],[15,10,16,11],[15,12,16,13],[15,14,16,15]]}
[null,null,null,null,"MATRIZ DE EVALUACIÓN"]
[]
[]
[null,null,null,null,null,null,null,null,null,null,null,null,null,null,null,null,null,null,null,null,"CICLO ESCOLAR ",null,{"$f":"IF('1ERPA'!W2=\"\",\"\",'1ERPA'!W2)","v":"2018-2019"}]
[null,null,null,null,null,null,null,null,null,null,null,null,null,null,null,null,null,null,null,null,null,{"$f":"IF('3ERPA'!A3=\"\",\"\",'3ERPA'!A3)","v":"ORDINARIO"}]
[]
[null,"LICENCIATURA EN:",{"$f":"IF('1ERPA'!M5=\"\",\"\",'1ERPA'!M5)","v":"Ingeniería en Sistemas Computacionales"}]
[null,"ASIGNATURA:",{"$f":"IF('1ERPA'!AD5=\"\",\"\",'1ERPA'!AD5)","v":"SEGURIDAD INFORMÁTICA Y DE REDES"}]
[null,{"$f":"'1ERPA'!J7","v":"CUATRIMESTRE:"},{"$f":"IF('1ERPA'!K7=\"\",\"\",'1ERPA'!K7)","v":"QUINTO"}]
[null,"GRUPO:",{"$f":"IF('1ERPA'!Q7=\"\",\"\",'1ERPA'!Q7)","v":"A"}]
[null,"PERIODO:",{"$f":"IF('1ERPA'!V7=\"\",\"\",'1ERPA'!V7)","v":"A"},null,null,null,null,null,null,null,null,null,null,null,null,{"$f":"IF('1ERPA'!X10=\"\",\"\",'1ERPA'!X10)","v":"ALDO ORTEGA PACHECO"}]
[null,"COMPETENCIA:","Instalar, configurar y\nadministrar un servidor web\nmail poniéndolo a prueba\ncomo servicio de correo\nelectrónico dentro de la\nuniversidad.",null,null,null,null,null,null,null,null,null,null,null,null,"NOMBRE Y FIRMA DEL CATEDRÁTICO"]
[]
["No.","Alumnos","Indicadores de desempeño",null,null,null,null,null,{"$f":"IF(H15>S14,\"POR ENCIMA DEL PORCENTAJE\",IF(H15<S14,\"POR DEBAJO DEL PORCENTAJE\",\" Evaluación de evidencias de aprendizaje\"))","v":"POR DEBAJO DEL PORCENTAJE"},null,null,null,null,null,null,null,null,null,0.5,null,"Fines Formativos",null,"SUMA TOTAL"]
[null,null,{"$f":"SUM(C19:H19)","v":0.03},{"$f":"IF(C15>G15,\"POR ENCIMA DEL PORCENTAJE\",IF(C15<G15,\"POR DEBAJO DEL PORCENTAJE\",\"(Niveles de dominio)\"))","v":"POR DEBAJO DEL PORCENTAJE"},null,null,0.5,{"$f":"SUM(J19,L19,N19,P19,R19,T19)","v":0.28000000000000003}]
[null,null,"ID1\nSin nivel\nNi lo intenta, no participa, no cumple, no es competente\nPre-formal\nDefine Mantenimiento preventivo y correctivo de una red\nReceptivo\nIdentifica los Elementos Mantenimiento preventivo y correctivo de una red\nResolutivo\nAnaliza el tipo de Mantenimiento preventivo y correctivo de una red\nAutónomo\nValora cual Mantenimiento aplicar de una red\nEstratégico\nExplica y aplica el\nMantenimiento preventivo y correctivo de una red\n","d",null,"","","","d",null,"EA2. Intercambio de opiniones acerca del Mantenimiento preventivo y correctivo de una red.",null,null,null,null,null,null,null,null,null,"Autoevaluación","Coevaluación"]
[]
[null,null,null,null,null,null,null,null,"C","P","C","P","C","P","C","P","C","P","C","P"]
[null,null,0.03,null,null,"","","",2,0.03,1,0.25]
[{"$f":"IF(B20=\"\",\"\",1)","v":1},{"$f":"IF('1ERPA'!F17=\"\",\"\",'1ERPA'!F17)","v":"GUZMAN SANTOS ALAN"},"Resolutivo",null,null,null,null,null,1,{"$f":"IF(I20=\"\",\"\",($J$19/$I$19)*I20)","v":1.4999999999999999E-2},1,{"$f":"IF(K20=\"\",\"\",($L$19/$K$19)*K20)","v":0.25},null,{"$f":"IF(M20=\"\",\"\",($N$19/$M$19)*M20)","v":""},null,{"$f":"IF(O20=\"\",\"\",($P$19/$O$19)*O20)","v":""},null,{"$f":"IF(Q20=\"\",\"\",($R$19/$Q$19)*Q20)","v":""},null,{"$f":"IF(S20=\"\",\"\",($T$19/$S$19)*S20)","v":""},null,null,{"$f":"IF(B20=\"\",\"\",(IF(B20=\"\",0,IF(C20=\"Sin Nivel\",($C$19)*0,IF(C20=\"Pre-Formal\",($C$19)*60%,IF(C20=\"Receptivo\",($C$19)*70%,IF(C20=\"Resolutivo\",($C$19)*80%,IF(C20=\"Autónomo\",($C$19)*90%,IF(C20=\"Estratégico\",($C$19)*100%,0)))))))+IF(D20=\"\",0,IF(D20=\"Sin Nivel\",($D$19)*0,IF(D20=\"Pre-Formal\",($D$19)*60%,IF(D20=\"Receptivo\",($D$19)*70%,IF(D20=\"Resolutivo\",($D$19)*80%,IF(D20=\"Autónomo\",($D$19)*90%,IF(D20=\"Estratégico\",($D$19)*100%,0)))))))+IF(E20=\"\",0,IF(E20=\"Sin Nivel\",($E$19)*0,IF(E20=\"Pre-Formal\",($E$19)*60%,IF(E20=\"Receptivo\",($E$19)*70%,IF(E20=\"Resolutivo\",($E$19)*80%,IF(E20=\"Autónomo\",($E$19)*90%,IF(E20=\"Estratégico\",($E$19)*100%,0)))))))+IF(F20=\"\",0,IF(F20=\"Sin Nivel\",($F$19)*0,IF(F20=\"Pre-Formal\",($F$19)*60%,IF(F20=\"Receptivo\",($F$19)*70%,IF(F20=\"Resolutivo\",($F$19)*80%,IF(F20=\"Autónomo\",($F$19)*90%,IF(F20=\"Estratégico\",($F$19)*100%,0)))))))+IF(G20=\"\",0,IF(G20=\"Sin Nivel\",($G$19)*0,IF(G20=\"Pre-Formal\",($G$19)*60%,IF(G20=\"Receptivo\",($G$19)*70%,IF(G20=\"Resolutivo\",($G$19)*80%,IF(G20=\"Autónomo\",($G$19)*90%,IF(G20=\"Estratégico\",($G$19)*100%,0)))))))+IF(H20=\"\",0,IF(H20=\"Sin Nivel\",($H$19)*0,IF(H20=\"Pre-Formal\",($H$19)*60%,IF(H20=\"Receptivo\",($H$19)*70%,IF(H20=\"Resolutivo\",($H$19)*80%,IF(H20=\"Autónomo\",($H$19)*90%,IF(H20=\"Estratégico\",($H$19)*100%,0))))))))+SUM(J20,L20,N20,P20,R20,T20))","v":0.28900000000000003},{"$f":"IF(C20=\"\",\"\",(IF(C20=\"\",0,IF(C20=\"Sin Nivel\",($C$19/5)*0,IF(C20=\"Pre-Formal\",($C$19/5)*1,IF(C20=\"Receptivo\",($C$19/5)*2,IF(C20=\"Resolutivo\",($C$19/5)*3,IF(C20=\"Autónomo\",($C$19/5)*4,IF(C20=\"Estratégico\",($C$19/5)*5,0)))))))+IF(D20=\"\",0,IF(D20=\"Sin Nivel\",($D$19/5)*0,IF(D20=\"Pre-Formal\",($D$19/5)*1,IF(D20=\"Receptivo\",($D$19/5)*2,IF(D20=\"Resolutivo\",($D$19/5)*3,IF(D20=\"Autónomo\",($D$19/5)*4,IF(D20=\"Estratégico\",($D$19/5)*5,0)))))))+IF(E20=\"\",0,IF(E20=\"Sin Nivel\",($E$19/5)*0,IF(E20=\"Pre-Formal\",($E$19/5)*1,IF(E20=\"Receptivo\",($E$19/5)*2,IF(E20=\"Resolutivo\",($E$19/5)*3,IF(E20=\"Autónomo\",($E$19/5)*4,IF(E20=\"Estratégico\",($E$19/5)*5,0)))))))+IF(F20=\"\",0,IF(F20=\"Sin Nivel\",($F$19/5)*0,IF(F20=\"Pre-Formal\",($F$19/5)*1,IF(F20=\"Receptivo\",($F$19/5)*2,IF(F20=\"Resolutivo\",($F$19/5)*3,IF(F20=\"Autónomo\",($F$19/5)*4,IF(F20=\"Estratégico\",($F$19/5)*5,0)))))))+IF(G20=\"\",0,IF(G20=\"Sin Nivel\",($G$19/5)*0,IF(G20=\"Pre-Formal\",($G$19/5)*1,IF(G20=\"Receptivo\",($G$19/5)*2,IF(G20=\"Resolutivo\",($G$19/5)*3,IF(G20=\"Autónomo\",($G$19/5)*4,IF(G20=\"Estratégico\",($G$19/5)*5,0)))))))+IF(H20=\"\",0,IF(H20=\"Sin Nivel\",($H$19/5)*0,IF(H20=\"Pre-Formal\",($H$19/5)*1,IF(H20=\"Receptivo\",($H$19/5)*2,IF(H20=\"Resolutivo\",($H$19/5)*3,IF(H20=\"Autónomo\",($H$19/5)*4,IF(H20=\"Estratégico\",($H$19/5)*5,0)))))))))","v":1.8000000000000002E-2},{"$f":"SUM(J20,L20,N20,P20,R20,T20)","v":0.26500000000000001}]
[{"$f":"IF(B21=\"\",\"\",A20+1)","v":2},{"$f":"IF('1ERPA'!F18=\"\",\"\",'1ERPA'!F18)","v":"ILLAN MONJARDIN JOSE LUIS"},"Estratégico",null,null,null,null,null,1,{"$f":"IF(I21=\"\",\"\",($J$19/$I$19)*I21)","v":1.4999999999999999E-2},1,{"$f":"IF(K21=\"\",\"\",($L$19/$K$19)*K21)","v":0.25},null,{"$f":"IF(M21=\"\",\"\",($N$19/$M$19)*M21)","v":""},null,{"$f":"IF(O21=\"\",\"\",($P$19/$O$19)*O21)","v":""},null,{"$f":"IF(Q21=\"\",\"\",($R$19/$Q$19)*Q21)","v":""},null,{"$f":"IF(S21=\"\",\"\",($T$19/$S$19)*S21)","v":""},null,null,{"$f":"IF(B21=\"\",\"\",(IF(B21=\"\",0,IF(C21=\"Sin Nivel\",($C$19)*0,IF(C21=\"Pre-Formal\",($C$19)*60%,IF(C21=\"Receptivo\",($C$19)*70%,IF(C21=\"Resolutivo\",($C$19)*80%,IF(C21=\"Autónomo\",($C$19)*90%,IF(C21=\"Estratégico\",($C$19)*100%,0)))))))+IF(D21=\"\",0,IF(D21=\"Sin Nivel\",($D$19)*0,IF(D21=\"Pre-Formal\",($D$19)*60%,IF(D21=\"Receptivo\",($D$19)*70%,IF(D21=\"Resolutivo\",($D$19)*80%,IF(D21=\"Autónomo\",($D$19)*90%,IF(D21=\"Estratégico\",($D$19)*100%,0)))))))+IF(E21=\"\",0,IF(E21=\"Sin Nivel\",($E$19)*0,IF(E21=\"Pre-Formal\",($E$19)*60%,IF(E21=\"Receptivo\",($E$19)*70%,IF(E21=\"Resolutivo\",($E$19)*80%,IF(E21=\"Autónomo\",($E$19)*90%,IF(E21=\"Estratégico\",($E$19)*100%,0)))))))+IF(F21=\"\",0,IF(F21=\"Sin Nivel\",($F$19)*0,IF(F21=\"Pre-Formal\",($F$19)*60%,IF(F21=\"Receptivo\",($F$19)*70%,IF(F21=\"Resolutivo\",($F$19)*80%,IF(F21=\"Autónomo\",($F$19)*90%,IF(F21=\"Estratégico\",($F$19)*100%,0)))))))+IF(G21=\"\",0,IF(G21=\"Sin Nivel\",($G$19)*0,IF(G21=\"Pre-Formal\",($G$19)*60%,IF(G21=\"Receptivo\",($G$19)*70%,IF(G21=\"Resolutivo\",($G$19)*80%,IF(G21=\"Autónomo\",($G$19)*90%,IF(G21=\"Estratégico\",($G$19)*100%,0)))))))+IF(H21=\"\",0,IF(H21=\"Sin Nivel\",($H$19)*0,IF(H21=\"Pre-Formal\",($H$19)*60%,IF(H21=\"Receptivo\",($H$19)*70%,IF(H21=\"Resolutivo\",($H$19)*80%,IF(H21=\"Autónomo\",($H$19)*90%,IF(H21=\"Estratégico\",($H$19)*100%,0))))))))+SUM(J21,L21,N21,P21,R21,T21))","v":0.29500000000000004},{"$f":"IF(C21=\"\",\"\",(IF(C21=\"\",0,IF(C21=\"Sin Nivel\",($C$19/5)*0,IF(C21=\"Pre-Formal\",($C$19/5)*1,IF(C21=\"Receptivo\",($C$19/5)*2,IF(C21=\"Resolutivo\",($C$19/5)*3,IF(C21=\"Autónomo\",($C$19/5)*4,IF(C21=\"Estratégico\",($C$19/5)*5,0)))))))+IF(D21=\"\",0,IF(D21=\"Sin Nivel\",($D$19/5)*0,IF(D21=\"Pre-Formal\",($D$19/5)*1,IF(D21=\"Receptivo\",($D$19/5)*2,IF(D21=\"Resolutivo\",($D$19/5)*3,IF(D21=\"Autónomo\",($D$19/5)*4,IF(D21=\"Estratégico\",($D$19/5)*5,0)))))))+IF(E21=\"\",0,IF(E21=\"Sin Nivel\",($E$19/5)*0,IF(E21=\"Pre-Formal\",($E$19/5)*1,IF(E21=\"Receptivo\",($E$19/5)*2,IF(E21=\"Resolutivo\",($E$19/5)*3,IF(E21=\"Autónomo\",($E$19/5)*4,IF(E21=\"Estratégico\",($E$19/5)*5,0)))))))+IF(F21=\"\",0,IF(F21=\"Sin Nivel\",($F$19/5)*0,IF(F21=\"Pre-Formal\",($F$19/5)*1,IF(F21=\"Receptivo\",($F$19/5)*2,IF(F21=\"Resolutivo\",($F$19/5)*3,IF(F21=\"Autónomo\",($F$19/5)*4,IF(F21=\"Estratégico\",($F$19/5)*5,0)))))))+IF(G21=\"\",0,IF(G21=\"Sin Nivel\",($G$19/5)*0,IF(G21=\"Pre-Formal\",($G$19/5)*1,IF(G21=\"Receptivo\",($G$19/5)*2,IF(G21=\"Resolutivo\",($G$19/5)*3,IF(G21=\"Autónomo\",($G$19/5)*4,IF(G21=\"Estratégico\",($G$19/5)*5,0)))))))+IF(H21=\"\",0,IF(H21=\"Sin Nivel\",($H$19/5)*0,IF(H21=\"Pre-Formal\",($H$19/5)*1,IF(H21=\"Receptivo\",($H$19/5)*2,IF(H21=\"Resolutivo\",($H$19/5)*3,IF(H21=\"Autónomo\",($H$19/5)*4,IF(H21=\"Estratégico\",($H$19/5)*5,0)))))))))","v":0.03},{"$f":"SUM(J21,L21,N21,P21,R21,T21)","v":0.26500000000000001}]
[{"$f":"IF(B22=\"\",\"\",A21+1)","v":3},{"$f":"IF('1ERPA'!F19=\"\",\"\",'1ERPA'!F19)","v":"LA MADRID GONZALEZ FERNANDA ISABEL "},"Estratégico",null,null,null,null,null,1,1.4999999999999999E-2,1,0.25,null,"",null,"",null,"",null,"",null,null,0.29500000000000004,0.03,0.26500000000000001]
[{"$f":"IF(B23=\"\",\"\",A22+1)","v":4},{"$f":"IF('1ERPA'!F20=\"\",\"\",'1ERPA'!F20)","v":"LOPEZ CASTRO GLORIA KARINA"},"Estratégico",null,null,null,null,null,1,{"$f":"IF(I23=\"\",\"\",($J$19/$I$19)*I23)","v":1.4999999999999999E-2},1,{"$f":"IF(K23=\"\",\"\",($L$19/$K$19)*K23)","v":0.25},null,{"$f":"IF(M23=\"\",\"\",($N$19/$M$19)*M23)","v":""},null,{"$f":"IF(O23=\"\",\"\",($P$19/$O$19)*O23)","v":""},null,{"$f":"IF(Q23=\"\",\"\",($R$19/$Q$19)*Q23)","v":""},null,{"$f":"IF(S23=\"\",\"\",($T$19/$S$19)*S23)","v":""},null,null,0.29500000000000004]
[{"$f":"IF(B24=\"\",\"\",A23+1)","v":5},{"$f":"IF('1ERPA'!F21=\"\",\"\",'1ERPA'!F21)","v":"GUZMAN SANTOS ALAN"},"Estratégico",null,null,null,null,null,1,{"$f":"IF(I24=\"\",\"\",($J$19/$I$19)*I24)","v":1.4999999999999999E-2},1,{"$f":"IF(K24=\"\",\"\",($L$19/$K$19)*K24)","v":0.25},null,{"$f":"IF(M24=\"\",\"\",($N$19/$M$19)*M24)","v":""},null,{"$f":"IF(O24=\"\",\"\",($P$19/$O$19)*O24)","v":""},null,{"$f":"IF(Q24=\"\",\"\",($R$19/$Q$19)*Q24)","v":""},null,{"$f":"IF(S24=\"\",\"\",($T$19/$S$19)*S24)","v":""},null,null,0.29500000000000004,0.03,0.26500000000000001]
[{"$f":"IF(B25=\"\",\"\",A24+1)","v":6},{"$f":"IF('1ERPA'!F22=\"\",\"\",'1ERPA'!F22)","v":"Y"},"Estratégico",null,null,null,null,null,1,{"$f":"IF(I25=\"\",\"\",($J$19/$I$19)*I25)","v":1.4999999999999999E-2},1,{"$f":"IF(K25=\"\",\"\",($L$19/$K$19)*K25)","v":0.25},null,{"$f":"IF(M25=\"\",\"\",($N$19/$M$19)*M25)","v":""},null,{"$f":"IF(O25=\"\",\"\",($P$19/$O$19)*O25)","v":""},null,{"$f":"IF(Q25=\"\",\"\",($R$19/$Q$19)*Q25)","v":""},null,{"$f":"IF(S25=\"\",\"\",($T$19/$S$19)*S25)","v":""},null,null,0.29500000000000004,0.03,0.26500000000000001]
[7,{"$f":"IF('1ERPA'!F23=\"\",\"\",'1ERPA'!F23)","v":"U"},"Estratégico",null,null,null,null,null,1,1.4999999999999999E-2,1,0.25,null,"",null,"",null,"",null,"",null,null,0.29500000000000004,0.03,0.26500000000000001]
[8,{"$f":"IF('1ERPA'!F24=\"\",\"\",'1ERPA'!F24)","v":"ILLAN MONJARDIN JOSE LUIS"},"Estratégico",null,null,null,null,null,1,1.4999999999999999E-2,1,0.25,null,"",null,"",null,"",null,"",null,null,0.29500000000000004,0.03,0.26500000000000001]
[{"$f":"IF(B28=\"\",\"\",A27+1)","v":9},{"$f":"IF('1ERPA'!F25=\"\",\"\",'1ERPA'!F25)","v":"e"},"Estratégico",null,null,null,null,null,2,{"$f":"IF(I28=\"\",\"\",($J$19/$I$19)*I28)","v":0.03},2,{"$f":"IF(K28=\"\",\"\",($L$19/$K$19)*K28)","v":0.5},null,{"$f":"IF(M28=\"\",\"\",($N$19/$M$19)*M28)","v":""},null,{"$f":"IF(O28=\"\",\"\",($P$19/$O$19)*O28)","v":""},null,{"$f":"IF(Q28=\"\",\"\",($R$19/$Q$19)*Q28)","v":""},null,{"$f":"IF(S28=\"\",\"\",($T$19/$S$19)*S28)","v":""},null,null,{"$f":"IF(B28=\"\",\"\",(IF(B28=\"\",0,IF(C28=\"Sin Nivel\",($C$19)*0,IF(C28=\"Pre-Formal\",($C$19)*60%,IF(C28=\"Receptivo\",($C$19)*70%,IF(C28=\"Resolutivo\",($C$19)*80%,IF(C28=\"Autónomo\",($C$19)*90%,IF(C28=\"Estratégico\",($C$19)*100%,0)))))))+IF(D28=\"\",0,IF(D28=\"Sin Nivel\",($D$19)*0,IF(D28=\"Pre-Formal\",($D$19)*60%,IF(D28=\"Receptivo\",($D$19)*70%,IF(D28=\"Resolutivo\",($D$19)*80%,IF(D28=\"Autónomo\",($D$19)*90%,IF(D28=\"Estratégico\",($D$19)*100%,0)))))))+IF(E28=\"\",0,IF(E28=\"Sin Nivel\",($E$19)*0,IF(E28=\"Pre-Formal\",($E$19)*60%,IF(E28=\"Receptivo\",($E$19)*70%,IF(E28=\"Resolutivo\",($E$19)*80%,IF(E28=\"Autónomo\",($E$19)*90%,IF(E28=\"Estratégico\",($E$19)*100%,0)))))))+IF(F28=\"\",0,IF(F28=\"Sin Nivel\",($F$19)*0,IF(F28=\"Pre-Formal\",($F$19)*60%,IF(F28=\"Receptivo\",($F$19)*70%,IF(F28=\"Resolutivo\",($F$19)*80%,IF(F28=\"Autónomo\",($F$19)*90%,IF(F28=\"Estratégico\",($F$19)*100%,0)))))))+IF(G28=\"\",0,IF(G28=\"Sin Nivel\",($G$19)*0,IF(G28=\"Pre-Formal\",($G$19)*60%,IF(G28=\"Receptivo\",($G$19)*70%,IF(G28=\"Resolutivo\",($G$19)*80%,IF(G28=\"Autónomo\",($G$19)*90%,IF(G28=\"Estratégico\",($G$19)*100%,0)))))))+IF(H28=\"\",0,IF(H28=\"Sin Nivel\",($H$19)*0,IF(H28=\"Pre-Formal\",($H$19)*60%,IF(H28=\"Receptivo\",($H$19)*70%,IF(H28=\"Resolutivo\",($H$19)*80%,IF(H28=\"Autónomo\",($H$19)*90%,IF(H28=\"Estratégico\",($H$19)*100%,0))))))))+SUM(J28,L28,N28,P28,R28,T28))","v":0.56000000000000005}]
[10,{"$f":"IF('1ERPA'!F26=\"\",\"\",'1ERPA'!F26)","v":"f"},"Estratégico",null,null,null,null,null,3,4.4999999999999998E-2,3,0.75,null,"",null,"",null,"",null,"",null,null,0.82500000000000007]
[11,{"$f":"IF('1ERPA'!F27=\"\",\"\",'1ERPA'!F27)","v":"GUZMAN SANTOS ALAN"},"Estratégico",null,null,null,null,null,4,0.06,4,1,null,"",null,"",null,"",null,"",null,null,1.0900000000000001]
[12,{"$f":"IF('1ERPA'!F28=\"\",\"\",'1ERPA'!F28)","v":"h"},"Estratégico",null,null,null,null,null,5,7.4999999999999997E-2,5,1.25,null,"",null,"",null,"",null,"",null,null,1.355]
[13,{"$f":"IF('1ERPA'!F29=\"\",\"\",'1ERPA'!F29)","v":"ILLAN MONJARDIN JOSE LUIS"},"Estratégico",null,null,null,null,null,6,0.09,6,1.5,null,"",null,"",null,"",null,"",null,null,1.62]
[14,{"$f":"IF('1ERPA'!F30=\"\",\"\",'1ERPA'!F30)","v":"T"},null,null,null,null,null,null,null,"",null,"",null,"",null,"",null,"",null,"",null,null,0]
["",{"$f":"IF('1ERPA'!F31=\"\",\"\",'1ERPA'!F31)","v":""},null,null,null,null,null,null,null,"",null,"",null,"",null,"",null,"",null,"",null,null,""]
["",{"$f":"IF('1ERPA'!F32=\"\",\"\",'1ERPA'!F32)","v":""},null,null,null,null,null,null,null,"",null,"",null,"",null,"",null,"",null,"",null,null,""]
["",{"$f":"IF('1ERPA'!F33=\"\",\"\",'1ERPA'!F33)","v":""},null,null,null,null,null,null,null,"",null,"",null,"",null,"",null,"",null,"",null,null,""]
["",{"$f":"IF('1ERPA'!F34=\"\",\"\",'1ERPA'!F34)","v":""},null,null,null,null,null,null,null,"",null,"",null,"",null,"",null,"",null,"",null,null,""]
["",{"$f":"IF('1ERPA'!F35=\"\",\"\",'1ERPA'!F35)","v":""},null,null,null,null,null,null,null,"",null,"",null,"",null,"",null,"",null,"",null,null,""]
["",{"$f":"IF('1ERPA'!F36=\"\",\"\",'1ERPA'!F36)","v":""},null,null,null,null,null,null,null,"",null,"",null,"",null,"",null,"",null,"",null,null,""]
["",{"$f":"IF('1ERPA'!F37=\"\",\"\",'1ERPA'!F37)","v":""},null,null,null,null,null,null,null,"",null,"",null,"",null,"",null,"",null,"",null,null,""]
["",{"$f":"IF('1ERPA'!F38=\"\",\"\",'1ERPA'!F38)","v":""},null,null,null,null,null,null,null,"",null,"",null,"",null,"",null,"",null,"",null,null,""]
["",{"$f":"IF('1ERPA'!F39=\"\",\"\",'1ERPA'!F39)","v":""},null,null,null,null,null,null,null,"",null,"",null,"",null,"",null,"",null,"",null,null,""]
["",{"$f":"IF('1ERPA'!F40=\"\",\"\",'1ERPA'!F40)","v":""},null,null,null,null,null,null,null,"",null,"",null,"",null,"",null,"",null,"",null,null,""]
["",{"$f":"IF('1ERPA'!F41=\"\",\"\",'1ERPA'!F41)","v":""},null,null,null,null,null,null,null,"",null,"",null,"",null,"",null,"",null,"",null,null,""]
["",{"$f":"IF('1ERPA'!F42=\"\",\"\",'1ERPA'!F42)","v":""},null,null,null,null,null,null,null,"",null,"",null,"",null,"",null,"",null,"",null,null,""]
["",{"$f":"IF('1ERPA'!F43=\"\",\"\",'1ERPA'!F43)","v":""},null,null,null,null,null,null,null,"",null,"",null,"",null,"",null,"",null,"",null,null,""]
["",{"$f":"IF('1ERPA'!F44=\"\",\"\",'1ERPA'!F44)","v":""},null,null,null,null,null,null,null,"",null,"",null,"",null,"",null,"",null,"",null,null,"","",0]
["",{"$f":"IF('1ERPA'!F45=\"\",\"\",'1ERPA'!F45)","v":""},null,null,null,null,null,null,null,{"$f":"IF(I48=\"\",\"\",($J$19/$I$19)*I48)","v":""},null,{"$f":"IF(K48=\"\",\"\",($L$19/$K$19)*K48)","v":""},null,"",null,"",null,"",null,"",null,null,"","",0]
["",{"$f":"IF('1ERPA'!F46=\"\",\"\",'1ERPA'!F46)","v":""},null,null,null,null,null,null,null,"",null,"",null,"",null,"",null,"",null,"",null,null,"","",0]
["",{"$f":"IF('1ERPA'!F47=\"\",\"\",'1ERPA'!F47)","v":""},null,null,null,null,null,null,null,{"$f":"IF(I50=\"\",\"\",($J$19/$I$19)*I50)","v":""},null,{"$f":"IF(K50=\"\",\"\",($L$19/$K$19)*K50)","v":""},null,"",null,"",null,"",null,"",null,null,"","",0]
["",{"$f":"IF('1ERPA'!F48=\"\",\"\",'1ERPA'!F48)","v":""},null,null,null,null,null,null,null,"",null,"",null,"",null,"",null,"",null,"",null,null,"","",0]
["",{"$f":"IF('1ERPA'!F49=\"\",\"\",'1ERPA'!F49)","v":""},null,null,null,null,null,null,null,"",null,"",null,"",null,"",null,"",null,"",null,null,"","",0]
["",{"$f":"IF('1ERPA'!F50=\"\",\"\",'1ERPA'!F50)","v":""},null,null,null,null,null,null,null,"",null,"",null,"",null,"",null,"",null,"",null,null,"","",0]
["",{"$f":"IF('1ERPA'!F51=\"\",\"\",'1ERPA'!F51)","v":""},null,null,null,null,null,null,null,"",null,"",null,"",null,"",null,"",null,"",null,null,"","",0]
["",{"$f":"IF('1ERPA'!F52=\"\",\"\",'1ERPA'!F52)","v":""},null,null,null,null,null,null,null,"",null,"",null,"",null,"",null,"",null,"",null,null,"","",0]
["",{"$f":"IF('1ERPA'!F53=\"\",\"\",'1ERPA'!F53)","v":""},null,null,null,null,null,null,null,"",null,"",null,"",null,"",null,"",null,"",null,null,"","",0]
[{"$f":"IF(B57=\"\",\"\",A56+1)","v":""},{"$f":"IF('1ERPA'!F54=\"\",\"\",'1ERPA'!F54)","v":""},null,null,null,null,null,null,null,"",null,"",null,"",null,"",null,"",null,"",null,null,"","",0]
["",{"$f":"IF('1ERPA'!F55=\"\",\"\",'1ERPA'!F55)","v":""},null,null,null,null,null,null,null,"",null,"",null,"",null,"",null,"",null,"",null,null,"","",0]
["",{"$f":"IF('1ERPA'!F56=\"\",\"\",'1ERPA'!F56)","v":""},null,null,null,null,null,null,null,"",null,"",null,"",null,"",null,"",null,"",null,null,"","",0]
["",{"$f":"IF('1ERPA'!F57=\"\",\"\",'1ERPA'!F57)","v":""},null,null,null,null,null,null,null,"",null,"",null,"",null,"",null,"",null,"",null,null,"","",0]
["",{"$f":"IF('1ERPA'!F58=\"\",\"\",'1ERPA'!F58)","v":""},null,null,null,null,null,null,null,"",null,"",null,"",null,"",null,"",null,"",null,null,"","",0]
["",{"$f":"IF('1ERPA'!F59=\"\",\"\",'1ERPA'!F59)","v":""},null,null,null,null,null,null,null,"",null,"",null,"",null,"",null,"",null,"",null,null,"","",0]
["",{"$f":"IF('1ERPA'!F60=\"\",\"\",'1ERPA'!F60)","v":""},null,null,null,null,null,null,null,"",null,"",null,"",null,"",null,"",null,"",null,null,"","",0]
["",{"$f":"IF('1ERPA'!F61=\"\",\"\",'1ERPA'!F61)","v":""},null,null,null,null,null,null,null,"",null,"",null,"",null,"",null,"",null,"",null,null,"","",0]
["",{"$f":"IF('1ERPA'!F62=\"\",\"\",'1ERPA'!F62)","v":""},null,null,null,null,null,null,null,"",null,"",null,"",null,"",null,"",null,"",null,null,"","",0]
["",{"$f":"IF('1ERPA'!F63=\"\",\"\",'1ERPA'!F63)","v":""},null,null,null,null,null,null,null,"",null,"",null,"",null,"",null,"",null,"",null,null,"","",0]
["",{"$f":"IF('1ERPA'!F64=\"\",\"\",'1ERPA'!F64)","v":""},null,null,null,null,null,null,null,"",null,"",null,"",null,"",null,"",null,"",null,null,"","",0]
["",{"$f":"IF('1ERPA'!F65=\"\",\"\",'1ERPA'!F65)","v":""},null,null,null,null,null,null,null,"",null,"",null,"",null,"",null,"",null,"",null,null,"","",0]
["",{"$f":"IF('1ERPA'!F66=\"\",\"\",'1ERPA'!F66)","v":""},null,null,null,null,null,null,null,"",null,"",null,"",null,"",null,"",null,"",null,null,"","",0]

{"sheet":"CIERRE","index":9,"n_rows":62,"n_cols":40,"rows_kept":62,"cut":false,"hidden":false,"merged":[[60,23,60,34],[61,23,61,34],[16,18,16,22],[18,18,18,22],[18,23,18,39],[20,18,20,22],[20,23,20,39],[22,23,22,25],[22,28,22,29],[22,18,22,22],[4,29,11,29],[1,13,1,15],[1,16,1,17],[22,36,22,38],[12,18,12,22],[12,35,12,39],[13,18,13,22],[14,18,14,22],[4,32,11,32],[4,33,11,33],[4,34,11,34],[4,28,11,28],[6,2,11,2],[6,3,11,3],[6,4,11,4],[6,5,11,5],[6,6,11,6],[6,7,11,7],[6,8,11,8],[4,25,11,25],[4,26,11,26],[4,27,11,27],[6,9,11,9],[4,24,11,24],[0,0,0,39],[2,0,2,39],[4,0,11,0],[4,1,11,1],[4,2,5,4],[4,5,5,7],[4,8,5,10],[4,11,11,11],[4,12,11,12],[6,10,11,10],[4,31,11,31],[4,13,11,13],[4,14,11,14],[4,15,11,15],[4,16,11,16],[4,23,11,23]]}
["CONTROL DE ESTADISTICA SEMESTRAL"]
[null,null,null,null,null,null,null,null,null,null,null,null,null,"CICLO ESCOLAR ",null,null,{"$f":"IF('1ERPA'!W2=\"\",\"\",'1ERPA'!W2)","v":"2018-2019"}]
[]
[]
["No.","NOMBRE DEL ALUMNO","PRIMER PARCIAL",null,null,"SEGUNDO PARCIAL",null,null,"ORDINARIO",null,null,"PROMEDIO % ASISTENCIA","PROMEDIO DE CALIFICACIONES","CALIF. CON LETRA","SUMA DEL % PARCIALES","CALIFICACIÓN","CALIF. CON LETRA",null,null,null,null,null,null,"PROMEDIO MENSUAL ASISTENCIA","PORCENTAJE DE APROBACIÓN","PROMEDIO DE EFICIENCIA","PORCENTAJE DE AVANCE PROGRAMÁTICO","% ASISTENCIA","CALIFICACIÓN","% PARCIAL",null,"PROMEDIO % ASISTENCIA","PROMEDIO DE CALIFICACIONES","SUMA DEL % PARCIALES","CALIFICACIÓN"]
[]
[null,null,"% ASISTENCIA","CALIFICACIÓN","% PARCIAL","% ASISTENCIA","CALIFICACIÓN","% PARCIAL","% ASISTENCIA","CALIFICACIÓN","% PARCIAL"]
[]
[]
[]
[]
[]
[{"$f":"IF(B13=\"\",\"\",1)","v":1},{"$f":"IF('1ERPA'!F17=\"\",\"\",'1ERPA'!F17)","v":"GUZMAN SANTOS ALAN"},{"$f":"'1ERPA'!AM17","v":100},{"$f":"'1ERPA'!AO17","v":9},{"$f":"'1ERPA'!AQ17","v":22.5},{"$f":"'2DOPA'!AM17","v":100},{"$f":"'2DOPA'!AO17","v":10},{"$f":"'2DOPA'!AQ17","v":25},{"$f":"'3ERPA'!AM17","v":100},{"$f":"'3ERPA'!AO17","v":3},{"$f":"'3ERPA'!AQ17","v":15},{"$f":"IF(A13=\"\",\"\",AVERAGE(C13,F13,I13))","v":100},{"$f":"IF(A13=\"\",\"\",AVERAGE(D13,G13,J13))","v":7.333333333333333},{"$f":"IF(A13=\"\",\"\",IF(M13>=9.6,\"DIEZ\",IF(M13>=8.6,\"NUEVE\",IF(M13>=7.6,\"OCHO\",IF(M13>=6.6,\"SIETE\",IF(M13>=6,\"SEIS\",IF(M13<=5.9,\"CINCO\",\"\")))))))","v":"SIETE"},{"$f":"IF(A13=\"\",\"\",SUM(E13,H13,K13))","v":62.5},{"$f":"IF(A13=\"\",\"\",O13/10)","v":6.25},{"$f":"IF(A13=\"\",\"\",IF(P13>=9.6,\"DIEZ\",IF(P13>=8.6,\"NUEVE\",IF(P13>=7.6,\"OCHO\",IF(P13>=6.6,\"SIETE\",IF(P13>=6,\"SEIS\",IF(P13<=5.9,\"CINCO\",\"\")))))))","v":"SEIS"},null,"PRIMER PARCIAL",null,null,null,null,{"$f":"'1ERPRE'!T14","v":13.9375},{"$f":"'1ERPRE'!AM14","v":100},{"$f":"'1ERPRE'!R22","v":9.2809523809523817},{"$f":"'1ERPRE'!AM22","v":83.333333333333329},{"$f":"IF(C13=\"\",0,AVERAGE(C13:C62))","v":96.428571428571431},{"$f":"IF(D13=\"\",0,AVERAGE(D13:D62))","v":8.9285714285714288},{"$f":"IF(E13=\"\",0,AVERAGE(E13:E62))","v":22.321428571428573},null,{"$f":"IF(L13=\"\",0,AVERAGE(L13:L62))","v":98.571428571428569},{"$f":"IF(M13=\"\",0,AVERAGE(M13:M62))","v":8.0833333333333339},{"$f":"IF(O13=\"\",0,AVERAGE(O13:O62))","v":71.071428571428569},{"$f":"IF(P13=\"\",0,AVERAGE(P13:P62))","v":7.1071428571428568},"PROMEDIO GENERAL"]
[{"$f":"IF(B14=\"\",\"\",A13+1)","v":2},{"$f":"IF('1ERPA'!F18=\"\",\"\",'1ERPA'!F18)","v":"ILLAN MONJARDIN JOSE LUIS"},{"$f":"'1ERPA'!AM18","v":100},{"$f":"'1ERPA'!AO18","v":9},{"$f":"'1ERPA'!AQ18","v":22.5},{"$f":"'2DOPA'!AM18","v":100},{"$f":"'2DOPA'!AO18","v":10},{"$f":"'2DOPA'!AQ18","v":25},{"$f":"'3ERPA'!AM18","v":100},{"$f":"'3ERPA'!AO18","v":3},{"$f":"'3ERPA'!AQ18","v":15},{"$f":"IF(A14=\"\",\"\",AVERAGE(C14,F14,I14))","v":100},{"$f":"IF(A14=\"\",\"\",AVERAGE(D14,G14,J14))","v":7.333333333333333},{"$f":"IF(A14=\"\",\"\",IF(M14>=9.6,\"DIEZ\",IF(M14>=8.6,\"NUEVE\",IF(M14>=7.6,\"OCHO\",IF(M14>=6.6,\"SIETE\",IF(M14>=6,\"SEIS\",IF(M14<=5.9,\"CINCO\",\"\")))))))","v":"SIETE"},{"$f":"IF(A14=\"\",\"\",SUM(E14,H14,K14))","v":62.5},{"$f":"IF(A14=\"\",\"\",O14/10)","v":6.25},{"$f":"IF(A14=\"\",\"\",IF(P14>=9.6,\"DIEZ\",IF(P14>=8.6,\"NUEVE\",IF(P14>=7.6,\"OCHO\",IF(P14>=6.6,\"SIETE\",IF(P14>=6,\"SEIS\",IF(P14<=5.9,\"CINCO\",\"\")))))))","v":"SEIS"},null,"SEGUNDO PARCIAL",null,null,null,null,{"$f":"'2DOPRE'!T14","v":13.9},{"$f":"'2DOPRE'!AM14","v":100},{"$f":"'2DOPRE'!R22","v":11.996031746031745},{"$f":"'2DOPRE'!AM22","v":100},{"$f":"IF(F13=\"\",0,AVERAGE(F13:F62))","v":99.230769230769226},{"$f":"IF(G13=\"\",0,AVERAGE(G13:G62))","v":9.7857142857142865},{"$f":"IF(H13=\"\",0,AVERAGE(H13:H62))","v":24.464285714285715}]
[{"$f":"IF(B15=\"\",\"\",A14+1)","v":3},{"$f":"IF('1ERPA'!F19=\"\",\"\",'1ERPA'!F19)","v":"LA MADRID GONZALEZ FERNANDA ISABEL "},{"$f":"'1ERPA'!AM19","v":100},{"$f":"'1ERPA'!AO19","v":8},{"$f":"'1ERPA'!AQ19","v":20},{"$f":"'2DOPA'!AM19","v":90},{"$f":"'2DOPA'!AO19","v":7},{"$f":"'2DOPA'!AQ19","v":17.5},{"$f":"'3ERPA'!AM19","v":100},{"$f":"'3ERPA'!AO19","v":3},{"$f":"'3ERPA'!AQ19","v":15},96.666666666666671,6,"SEIS",52.5,5.25,"CINCO",null,"TERCER PARCIAL",null,null,null,null,{"$f":"'3ERPRE'!T14","v":14},{"$f":"'3ERPRE'!AM14","v":35.714285714285715},{"$f":"'3ERPRE'!R22","v":5.5742857142857147},{"$f":"'3ERPRE'!AM22","v":100},{"$f":"IF(I13=\"\",0,AVERAGE(I13:I62))","v":100},{"$f":"IF(J13=\"\",0,AVERAGE(J13:J62))","v":5.2307692307692308},{"$f":"IF(K13=\"\",0,AVERAGE(K13:K62))","v":26.153846153846153}]
[{"$f":"IF(B16=\"\",\"\",A15+1)","v":4},{"$f":"IF('1ERPA'!F20=\"\",\"\",'1ERPA'!F20)","v":"LOPEZ CASTRO GLORIA KARINA"},{"$f":"'1ERPA'!AM20","v":100},{"$f":"'1ERPA'!AO20","v":9},{"$f":"'1ERPA'!AQ20","v":22.5},{"$f":"'2DOPA'!AM20","v":100},{"$f":"'2DOPA'!AO20","v":10},{"$f":"'2DOPA'!AQ20","v":25},{"$f":"'3ERPA'!AM20","v":100},{"$f":"'3ERPA'!AO20","v":3},{"$f":"'3ERPA'!AQ20","v":15},100,7.333333333333333,"SIETE",62.5,6.25,"SEIS"]
[{"$f":"IF(B17=\"\",\"\",A16+1)","v":5},{"$f":"IF('1ERPA'!F21=\"\",\"\",'1ERPA'!F21)","v":"GUZMAN SANTOS ALAN"},{"$f":"'1ERPA'!AM21","v":100},{"$f":"'1ERPA'!AO21","v":9},{"$f":"'1ERPA'!AQ21","v":22.5},{"$f":"'2DOPA'!AM21","v":100},{"$f":"'2DOPA'!AO21","v":10},{"$f":"'2DOPA'!AQ21","v":25},{"$f":"'3ERPA'!AM21","v":100},{"$f":"'3ERPA'!AO21","v":3},{"$f":"'3ERPA'!AQ21","v":15},100,7.333333333333333,"SIETE",62.5,6.25,"SEIS",null,"PROMEDIO",null,null,null,null,{"$f":"AVERAGE(X13:X15)","v":13.945833333333333},78.571428571428569,8.9504232804232799,94.444444444444443,98.553113553113562,7.9816849816849818,24.313186813186814]
[6,{"$f":"IF('1ERPA'!F22=\"\",\"\",'1ERPA'!F22)","v":"Y"},{"$f":"'1ERPA'!AM22","v":100},{"$f":"'1ERPA'!AO22","v":9},{"$f":"'1ERPA'!AQ22","v":22.5},{"$f":"'2DOPA'!AM22","v":100},{"$f":"'2DOPA'!AO22","v":10},{"$f":"'2DOPA'!AQ22","v":25},{"$f":"'3ERPA'!AM22","v":100},{"$f":"'3ERPA'!AO22","v":3},{"$f":"'3ERPA'!AQ22","v":15},100,7.333333333333333,"SIETE",62.5,6.25,"SEIS"]
[7,{"$f":"IF('1ERPA'!F23=\"\",\"\",'1ERPA'!F23)","v":"U"},{"$f":"'1ERPA'!AM23","v":100},{"$f":"'1ERPA'!AO23","v":9},{"$f":"'1ERPA'!AQ23","v":22.5},{"$f":"'2DOPA'!AM23","v":100},{"$f":"'2DOPA'!AO23","v":10},{"$f":"'2DOPA'!AQ23","v":25},{"$f":"'3ERPA'!AM23","v":100},{"$f":"'3ERPA'!AO23","v":3},{"$f":"'3ERPA'!AQ23","v":15},100,7.333333333333333,"SIETE",62.5,6.25,"SEIS",null,"LICENCIATURA EN: ",null,null,null,null,{"$f":"IF('1ERPA'!M5=\"\",\"\",'1ERPA'!M5)","v":"Ingeniería en Sistemas Computacionales"}]
[8,{"$f":"IF('1ERPA'!F24=\"\",\"\",'1ERPA'!F24)","v":"ILLAN MONJARDIN JOSE LUIS"},{"$f":"'1ERPA'!AM24","v":93.75},{"$f":"'1ERPA'!AO24","v":9},{"$f":"'1ERPA'!AQ24","v":22.5},{"$f":"'2DOPA'!AM24","v":100},{"$f":"'2DOPA'!AO24","v":10},{"$f":"'2DOPA'!AQ24","v":25},{"$f":"'3ERPA'!AM24","v":100},{"$f":"'3ERPA'!AO24","v":3},{"$f":"'3ERPA'!AQ24","v":15},97.916666666666671,7.333333333333333,"SIETE",62.5,6.25,"SEIS"]
[{"$f":"IF(B21=\"\",\"\",A20+1)","v":9},{"$f":"IF('1ERPA'!F25=\"\",\"\",'1ERPA'!F25)","v":"e"},{"$f":"'1ERPA'!AM25","v":93.75},{"$f":"'1ERPA'!AO25","v":9},{"$f":"'1ERPA'!AQ25","v":22.5},{"$f":"'2DOPA'!AM25","v":100},{"$f":"'2DOPA'!AO25","v":10},{"$f":"'2DOPA'!AQ25","v":25},{"$f":"'3ERPA'!AM25","v":100},{"$f":"'3ERPA'!AO25","v":6},{"$f":"'3ERPA'!AQ25","v":30},{"$f":"IF(A21=\"\",\"\",AVERAGE(C21,F21,I21))","v":97.916666666666671},{"$f":"IF(A21=\"\",\"\",AVERAGE(D21,G21,J21))","v":8.3333333333333339},{"$f":"IF(A21=\"\",\"\",IF(M21>=9.6,\"DIEZ\",IF(M21>=8.6,\"NUEVE\",IF(M21>=7.6,\"OCHO\",IF(M21>=6.6,\"SIETE\",IF(M21>=6,\"SEIS\",IF(M21<=5.9,\"CINCO\",\"\")))))))","v":"OCHO"},{"$f":"IF(A21=\"\",\"\",SUM(E21,H21,K21))","v":77.5},{"$f":"IF(A21=\"\",\"\",O21/10)","v":7.75},{"$f":"IF(A21=\"\",\"\",IF(P21>=9.6,\"DIEZ\",IF(P21>=8.6,\"NUEVE\",IF(P21>=7.6,\"OCHO\",IF(P21>=6.6,\"SIETE\",IF(P21>=6,\"SEIS\",IF(P21<=5.9,\"CINCO\",\"\")))))))","v":"OCHO"},null,"ASIGNATURA: ",null,null,null,null,{"$f":"IF('1ERPA'!AD5=\"\",\"\",'1ERPA'!AD5)","v":"SEGURIDAD INFORMÁTICA Y DE REDES"}]
[10,{"$f":"IF('1ERPA'!F26=\"\",\"\",'1ERPA'!F26)","v":"f"},{"$f":"'1ERPA'!AM26","v":93.75},{"$f":"'1ERPA'!AO26","v":9},{"$f":"'1ERPA'!AQ26","v":22.5},{"$f":"'2DOPA'!AM26","v":100},{"$f":"'2DOPA'!AO26","v":10},{"$f":"'2DOPA'!AQ26","v":25},{"$f":"'3ERPA'!AM26","v":100},{"$f":"'3ERPA'!AO26","v":8},{"$f":"'3ERPA'!AQ26","v":40},97.916666666666671,9,"NUEVE",87.5,8.75,"NUEVE"]
[11,{"$f":"IF('1ERPA'!F27=\"\",\"\",'1ERPA'!F27)","v":"GUZMAN SANTOS ALAN"},{"$f":"'1ERPA'!AM27","v":93.75},{"$f":"'1ERPA'!AO27","v":9},{"$f":"'1ERPA'!AQ27","v":22.5},{"$f":"'2DOPA'!AM27","v":100},{"$f":"'2DOPA'!AO27","v":10},{"$f":"'2DOPA'!AQ27","v":25},{"$f":"'3ERPA'!AM27","v":100},{"$f":"'3ERPA'!AO27","v":10},{"$f":"'3ERPA'!AQ27","v":50},97.916666666666671,9.6666666666666661,"DIEZ",97.5,9.75,"DIEZ",null,{"$f":"'1ERPA'!J7","v":"CUATRIMESTRE:"},null,null,null,null,{"$f":"IF('1ERPA'!K7=\"\",\"\",'1ERPA'!K7)","v":"QUINTO"},null,null,null,null,"GRUPO:",null,{"$f":"IF('1ERPA'!Q7=\"\",\"\",'1ERPA'!Q7)","v":"A"},null,null,null,null,null,"PERIODO: ",null,null,{"$f":"IF('1ERPA'!V7=\"\",\"\",'1ERPA'!V7)","v":"A"}]
[12,{"$f":"IF('1ERPA'!F28=\"\",\"\",'1ERPA'!F28)","v":"h"},{"$f":"'1ERPA'!AM28","v":93.75},{"$f":"'1ERPA'!AO28","v":9},{"$f":"'1ERPA'!AQ28","v":22.5},{"$f":"'2DOPA'!AM28","v":100},{"$f":"'2DOPA'!AO28","v":10},{"$f":"'2DOPA'!AQ28","v":25},{"$f":"'3ERPA'!AM28","v":100},{"$f":"'3ERPA'!AO28","v":10},{"$f":"'3ERPA'!AQ28","v":50},97.916666666666671,9.6666666666666661,"DIEZ",97.5,9.75,"DIEZ"]
[13,{"$f":"IF('1ERPA'!F29=\"\",\"\",'1ERPA'!F29)","v":"ILLAN MONJARDIN JOSE LUIS"},{"$f":"'1ERPA'!AM29","v":81.25},{"$f":"'1ERPA'!AO29","v":9},{"$f":"'1ERPA'!AQ29","v":22.5},{"$f":"'2DOPA'!AM29","v":100},{"$f":"'2DOPA'!AO29","v":10},{"$f":"'2DOPA'!AQ29","v":25},{"$f":"'3ERPA'!AM29","v":100},{"$f":"'3ERPA'!AO29","v":10},{"$f":"'3ERPA'!AQ29","v":50},93.75,9.6666666666666661,"DIEZ",97.5,9.75,"DIEZ"]
[14,{"$f":"IF('1ERPA'!F30=\"\",\"\",'1ERPA'!F30)","v":"T"},{"$f":"'1ERPA'!AM30","v":100},{"$f":"'1ERPA'!AO30","v":9},{"$f":"'1ERPA'!AQ30","v":22.5},{"$f":"'2DOPA'!AM30","v":""},{"$f":"'2DOPA'!AO30","v":10},{"$f":"'2DOPA'!AQ30","v":25},{"$f":"'3ERPA'!AM30","v":""},{"$f":"'3ERPA'!AO30","v":""},{"$f":"'3ERPA'!AQ30","v":""},100,9.5,"NUEVE",47.5,4.75,"CINCO"]
["",{"$f":"IF('1ERPA'!F31=\"\",\"\",'1ERPA'!F31)","v":""},{"$f":"'1ERPA'!AM31","v":""},{"$f":"'1ERPA'!AO31","v":""},{"$f":"'1ERPA'!AQ31","v":""},{"$f":"'2DOPA'!AM31","v":""},{"$f":"'2DOPA'!AO31","v":""},{"$f":"'2DOPA'!AQ31","v":""},{"$f":"'3ERPA'!AM31","v":""},{"$f":"'3ERPA'!AO31","v":""},{"$f":"'3ERPA'!AQ31","v":""},"","","","","",""]
["",{"$f":"IF('1ERPA'!F32=\"\",\"\",'1ERPA'!F32)","v":""},{"$f":"'1ERPA'!AM32","v":""},{"$f":"'1ERPA'!AO32","v":""},{"$f":"'1ERPA'!AQ32","v":""},{"$f":"'2DOPA'!AM32","v":""},{"$f":"'2DOPA'!AO32","v":""},{"$f":"'2DOPA'!AQ32","v":""},{"$f":"'3ERPA'!AM32","v":""},{"$f":"'3ERPA'!AO32","v":""},{"$f":"'3ERPA'!AQ32","v":""},"","","","","",""]
["",{"$f":"IF('1ERPA'!F33=\"\",\"\",'1ERPA'!F33)","v":""},{"$f":"'1ERPA'!AM33","v":""},{"$f":"'1ERPA'!AO33","v":""},{"$f":"'1ERPA'!AQ33","v":""},{"$f":"'2DOPA'!AM33","v":""},{"$f":"'2DOPA'!AO33","v":""},{"$f":"'2DOPA'!AQ33","v":""},{"$f":"'3ERPA'!AM33","v":""},{"$f":"'3ERPA'!AO33","v":""},{"$f":"'3ERPA'!AQ33","v":""},"","","","","",""]
["",{"$f":"IF('1ERPA'!F34=\"\",\"\",'1ERPA'!F34)","v":""},{"$f":"'1ERPA'!AM34","v":""},{"$f":"'1ERPA'!AO34","v":""},{"$f":"'1ERPA'!AQ34","v":""},{"$f":"'2DOPA'!AM34","v":""},{"$f":"'2DOPA'!AO34","v":""},{"$f":"'2DOPA'!AQ34","v":""},{"$f":"'3ERPA'!AM34","v":""},{"$f":"'3ERPA'!AO34","v":""},{"$f":"'3ERPA'!AQ34","v":""},"","","","","",""]
["",{"$f":"IF('1ERPA'!F35=\"\",\"\",'1ERPA'!F35)","v":""},{"$f":"'1ERPA'!AM35","v":""},{"$f":"'1ERPA'!AO35","v":""},{"$f":"'1ERPA'!AQ35","v":""},{"$f":"'2DOPA'!AM35","v":""},{"$f":"'2DOPA'!AO35","v":""},{"$f":"'2DOPA'!AQ35","v":""},{"$f":"'3ERPA'!AM35","v":""},{"$f":"'3ERPA'!AO35","v":""},{"$f":"'3ERPA'!AQ35","v":""},"","","","","",""]
["",{"$f":"IF('1ERPA'!F36=\"\",\"\",'1ERPA'!F36)","v":""},{"$f":"'1ERPA'!AM36","v":""},{"$f":"'1ERPA'!AO36","v":""},{"$f":"'1ERPA'!AQ36","v":""},{"$f":"'2DOPA'!AM36","v":""},{"$f":"'2DOPA'!AO36","v":""},{"$f":"'2DOPA'!AQ36","v":""},{"$f":"'3ERPA'!AM36","v":""},{"$f":"'3ERPA'!AO36","v":""},{"$f":"'3ERPA'!AQ36","v":""},"","","","","",""]
["",{"$f":"IF('1ERPA'!F37=\"\",\"\",'1ERPA'!F37)","v":""},{"$f":"'1ERPA'!AM37","v":""},{"$f":"'1ERPA'!AO37","v":""},{"$f":"'1ERPA'!AQ37","v":""},{"$f":"'2DOPA'!AM37","v":""},{"$f":"'2DOPA'!AO37","v":""},{"$f":"'2DOPA'!AQ37","v":""},{"$f":"'3ERPA'!AM37","v":""},{"$f":"'3ERPA'!AO37","v":""},{"$f":"'3ERPA'!AQ37","v":""},"","","","","",""]
["",{"$f":"IF('1ERPA'!F38=\"\",\"\",'1ERPA'!F38)","v":""},{"$f":"'1ERPA'!AM38","v":""},{"$f":"'1ERPA'!AO38","v":""},{"$f":"'1ERPA'!AQ38","v":""},{"$f":"'2DOPA'!AM38","v":""},{"$f":"'2DOPA'!AO38","v":""},{"$f":"'2DOPA'!AQ38","v":""},{"$f":"'3ERPA'!AM38","v":""},{"$f":"'3ERPA'!AO38","v":""},{"$f":"'3ERPA'!AQ38","v":""},"","","","","",""]
["",{"$f":"IF('1ERPA'!F39=\"\",\"\",'1ERPA'!F39)","v":""},{"$f":"'1ERPA'!AM39","v":""},{"$f":"'1ERPA'!AO39","v":""},{"$f":"'1ERPA'!AQ39","v":""},{"$f":"'2DOPA'!AM39","v":""},{"$f":"'2DOPA'!AO39","v":""},{"$f":"'2DOPA'!AQ39","v":""},{"$f":"'3ERPA'!AM39","v":""},{"$f":"'3ERPA'!AO39","v":""},{"$f":"'3ERPA'!AQ39","v":""},"","","","","",""]
["",{"$f":"IF('1ERPA'!F40=\"\",\"\",'1ERPA'!F40)","v":""},{"$f":"'1ERPA'!AM40","v":""},{"$f":"'1ERPA'!AO40","v":""},{"$f":"'1ERPA'!AQ40","v":""},{"$f":"'2DOPA'!AM40","v":""},{"$f":"'2DOPA'!AO40","v":""},{"$f":"'2DOPA'!AQ40","v":""},{"$f":"'3ERPA'!AM40","v":""},{"$f":"'3ERPA'!AO40","v":""},{"$f":"'3ERPA'!AQ40","v":""},"","","","","",""]
["",{"$f":"IF('1ERPA'!F41=\"\",\"\",'1ERPA'!F41)","v":""},{"$f":"'1ERPA'!AM41","v":""},{"$f":"'1ERPA'!AO41","v":""},{"$f":"'1ERPA'!AQ41","v":""},{"$f":"'2DOPA'!AM41","v":""},{"$f":"'2DOPA'!AO41","v":""},{"$f":"'2DOPA'!AQ41","v":""},{"$f":"'3ERPA'!AM41","v":""},{"$f":"'3ERPA'!AO41","v":""},{"$f":"'3ERPA'!AQ41","v":""},"","","","","",""]
["",{"$f":"IF('1ERPA'!F42=\"\",\"\",'1ERPA'!F42)","v":""},{"$f":"'1ERPA'!AM42","v":""},{"$f":"'1ERPA'!AO42","v":""},{"$f":"'1ERPA'!AQ42","v":""},{"$f":"'2DOPA'!AM42","v":""},{"$f":"'2DOPA'!AO42","v":""},{"$f":"'2DOPA'!AQ42","v":""},{"$f":"'3ERPA'!AM42","v":""},{"$f":"'3ERPA'!AO42","v":""},{"$f":"'3ERPA'!AQ42","v":""},"","","","","",""]
["",{"$f":"IF('1ERPA'!F43=\"\",\"\",'1ERPA'!F43)","v":""},{"$f":"'1ERPA'!AM43","v":""},{"$f":"'1ERPA'!AO43","v":""},{"$f":"'1ERPA'!AQ43","v":""},{"$f":"'2DOPA'!AM43","v":""},{"$f":"'2DOPA'!AO43","v":""},{"$f":"'2DOPA'!AQ43","v":""},{"$f":"'3ERPA'!AM43","v":""},{"$f":"'3ERPA'!AO43","v":""},{"$f":"'3ERPA'!AQ43","v":""},"","","","","",""]
["",{"$f":"IF('1ERPA'!F44=\"\",\"\",'1ERPA'!F44)","v":""},{"$f":"'1ERPA'!AM44","v":""},{"$f":"'1ERPA'!AO44","v":""},{"$f":"'1ERPA'!AQ44","v":""},{"$f":"'2DOPA'!AM44","v":""},{"$f":"'2DOPA'!AO44","v":""},{"$f":"'2DOPA'!AQ44","v":""},{"$f":"'3ERPA'!AM44","v":""},{"$f":"'3ERPA'!AO44","v":""},{"$f":"'3ERPA'!AQ44","v":""},"","","","","",""]
["",{"$f":"IF('1ERPA'!F45=\"\",\"\",'1ERPA'!F45)","v":""},{"$f":"'1ERPA'!AM45","v":""},{"$f":"'1ERPA'!AO45","v":""},{"$f":"'1ERPA'!AQ45","v":""},{"$f":"'2DOPA'!AM45","v":""},{"$f":"'2DOPA'!AO45","v":""},{"$f":"'2DOPA'!AQ45","v":""},{"$f":"'3ERPA'!AM45","v":""},{"$f":"'3ERPA'!AO45","v":""},{"$f":"'3ERPA'!AQ45","v":""},"","","","","",""]
["",{"$f":"IF('1ERPA'!F46=\"\",\"\",'1ERPA'!F46)","v":""},{"$f":"'1ERPA'!AM46","v":""},{"$f":"'1ERPA'!AO46","v":""},{"$f":"'1ERPA'!AQ46","v":""},{"$f":"'2DOPA'!AM46","v":""},{"$f":"'2DOPA'!AO46","v":""},{"$f":"'2DOPA'!AQ46","v":""},{"$f":"'3ERPA'!AM46","v":""},{"$f":"'3ERPA'!AO46","v":""},{"$f":"'3ERPA'!AQ46","v":""},"","","","","",""]
["",{"$f":"IF('1ERPA'!F47=\"\",\"\",'1ERPA'!F47)","v":""},{"$f":"'1ERPA'!AM47","v":""},{"$f":"'1ERPA'!AO47","v":""},{"$f":"'1ERPA'!AQ47","v":""},{"$f":"'2DOPA'!AM47","v":""},{"$f":"'2DOPA'!AO47","v":""},{"$f":"'2DOPA'!AQ47","v":""},{"$f":"'3ERPA'!AM47","v":""},{"$f":"'3ERPA'!AO47","v":""},{"$f":"'3ERPA'!AQ47","v":""},"","","","","",""]
["",{"$f":"IF('1ERPA'!F48=\"\",\"\",'1ERPA'!F48)","v":""},{"$f":"'1ERPA'!AM48","v":""},{"$f":"'1ERPA'!AO48","v":""},{"$f":"'1ERPA'!AQ48","v":""},{"$f":"'2DOPA'!AM48","v":""},{"$f":"'2DOPA'!AO48","v":""},{"$f":"'2DOPA'!AQ48","v":""},{"$f":"'3ERPA'!AM48","v":""},{"$f":"'3ERPA'!AO48","v":""},{"$f":"'3ERPA'!AQ48","v":""},"","","","","",""]
["",{"$f":"IF('1ERPA'!F49=\"\",\"\",'1ERPA'!F49)","v":""},{"$f":"'1ERPA'!AM49","v":""},{"$f":"'1ERPA'!AO49","v":""},{"$f":"'1ERPA'!AQ49","v":""},{"$f":"'2DOPA'!AM49","v":""},{"$f":"'2DOPA'!AO49","v":""},{"$f":"'2DOPA'!AQ49","v":""},{"$f":"'3ERPA'!AM49","v":""},{"$f":"'3ERPA'!AO49","v":""},{"$f":"'3ERPA'!AQ49","v":""},"","","","","",""]
["",{"$f":"IF('1ERPA'!F50=\"\",\"\",'1ERPA'!F50)","v":""},{"$f":"'1ERPA'!AM50","v":""},{"$f":"'1ERPA'!AO50","v":""},{"$f":"'1ERPA'!AQ50","v":""},{"$f":"'2DOPA'!AM50","v":""},{"$f":"'2DOPA'!AO50","v":""},{"$f":"'2DOPA'!AQ50","v":""},{"$f":"'3ERPA'!AM50","v":""},{"$f":"'3ERPA'!AO50","v":""},{"$f":"'3ERPA'!AQ50","v":""},"","","","","",""]
["",{"$f":"IF('1ERPA'!F51=\"\",\"\",'1ERPA'!F51)","v":""},{"$f":"'1ERPA'!AM51","v":""},{"$f":"'1ERPA'!AO51","v":""},{"$f":"'1ERPA'!AQ51","v":""},{"$f":"'2DOPA'!AM51","v":""},{"$f":"'2DOPA'!AO51","v":""},{"$f":"'2DOPA'!AQ51","v":""},{"$f":"'3ERPA'!AM51","v":""},{"$f":"'3ERPA'!AO51","v":""},{"$f":"'3ERPA'!AQ51","v":""},"","","","","",""]
["",{"$f":"IF('1ERPA'!F52=\"\",\"\",'1ERPA'!F52)","v":""},{"$f":"'1ERPA'!AM52","v":""},{"$f":"'1ERPA'!AO52","v":""},{"$f":"'1ERPA'!AQ52","v":""},{"$f":"'2DOPA'!AM52","v":""},{"$f":"'2DOPA'!AO52","v":""},{"$f":"'2DOPA'!AQ52","v":""},{"$f":"'3ERPA'!AM52","v":""},{"$f":"'3ERPA'!AO52","v":""},{"$f":"'3ERPA'!AQ52","v":""},"","","","","",""]
["",{"$f":"IF('1ERPA'!F53=\"\",\"\",'1ERPA'!F53)","v":""},{"$f":"'1ERPA'!AM53","v":""},{"$f":"'1ERPA'!AO53","v":""},{"$f":"'1ERPA'!AQ53","v":""},{"$f":"'2DOPA'!AM53","v":""},{"$f":"'2DOPA'!AO53","v":""},{"$f":"'2DOPA'!AQ53","v":""},{"$f":"'3ERPA'!AM53","v":""},{"$f":"'3ERPA'!AO53","v":""},{"$f":"'3ERPA'!AQ53","v":""},"","","","","",""]
["",{"$f":"IF('1ERPA'!F54=\"\",\"\",'1ERPA'!F54)","v":""},{"$f":"'1ERPA'!AM54","v":""},{"$f":"'1ERPA'!AO54","v":""},{"$f":"'1ERPA'!AQ54","v":""},{"$f":"'2DOPA'!AM54","v":""},{"$f":"'2DOPA'!AO54","v":""},{"$f":"'2DOPA'!AQ54","v":""},{"$f":"'3ERPA'!AM54","v":""},{"$f":"'3ERPA'!AO54","v":""},{"$f":"'3ERPA'!AQ54","v":""},"","","","","",""]
["",{"$f":"IF('1ERPA'!F55=\"\",\"\",'1ERPA'!F55)","v":""},{"$f":"'1ERPA'!AM55","v":""},{"$f":"'1ERPA'!AO55","v":""},{"$f":"'1ERPA'!AQ55","v":""},{"$f":"'2DOPA'!AM55","v":""},{"$f":"'2DOPA'!AO55","v":""},{"$f":"'2DOPA'!AQ55","v":""},{"$f":"'3ERPA'!AM55","v":""},{"$f":"'3ERPA'!AO55","v":""},{"$f":"'3ERPA'!AQ55","v":""},"","","","","",""]
["",{"$f":"IF('1ERPA'!F56=\"\",\"\",'1ERPA'!F56)","v":""},{"$f":"'1ERPA'!AM56","v":""},{"$f":"'1ERPA'!AO56","v":""},{"$f":"'1ERPA'!AQ56","v":""},{"$f":"'2DOPA'!AM56","v":""},{"$f":"'2DOPA'!AO56","v":""},{"$f":"'2DOPA'!AQ56","v":""},{"$f":"'3ERPA'!AM56","v":""},{"$f":"'3ERPA'!AO56","v":""},{"$f":"'3ERPA'!AQ56","v":""},"","","","","",""]
["",{"$f":"IF('1ERPA'!F57=\"\",\"\",'1ERPA'!F57)","v":""},{"$f":"'1ERPA'!AM57","v":""},{"$f":"'1ERPA'!AO57","v":""},{"$f":"'1ERPA'!AQ57","v":""},{"$f":"'2DOPA'!AM57","v":""},{"$f":"'2DOPA'!AO57","v":""},{"$f":"'2DOPA'!AQ57","v":""},{"$f":"'3ERPA'!AM57","v":""},{"$f":"'3ERPA'!AO57","v":""},{"$f":"'3ERPA'!AQ57","v":""},"","","","","",""]
["",{"$f":"IF('1ERPA'!F58=\"\",\"\",'1ERPA'!F58)","v":""},{"$f":"'1ERPA'!AM58","v":""},{"$f":"'1ERPA'!AO58","v":""},{"$f":"'1ERPA'!AQ58","v":""},{"$f":"'2DOPA'!AM58","v":""},{"$f":"'2DOPA'!AO58","v":""},{"$f":"'2DOPA'!AQ58","v":""},{"$f":"'3ERPA'!AM58","v":""},{"$f":"'3ERPA'!AO58","v":""},{"$f":"'3ERPA'!AQ58","v":""},"","","","","",""]
["",{"$f":"IF('1ERPA'!F59=\"\",\"\",'1ERPA'!F59)","v":""},{"$f":"'1ERPA'!AM59","v":""},{"$f":"'1ERPA'!AO59","v":""},{"$f":"'1ERPA'!AQ59","v":""},{"$f":"'2DOPA'!AM59","v":""},{"$f":"'2DOPA'!AO59","v":""},{"$f":"'2DOPA'!AQ59","v":""},{"$f":"'3ERPA'!AM59","v":""},{"$f":"'3ERPA'!AO59","v":""},{"$f":"'3ERPA'!AQ59","v":""},"","","","","",""]
["",{"$f":"IF('1ERPA'!F60=\"\",\"\",'1ERPA'!F60)","v":""},{"$f":"'1ERPA'!AM60","v":""},{"$f":"'1ERPA'!AO60","v":""},{"$f":"'1ERPA'!AQ60","v":""},{"$f":"'2DOPA'!AM60","v":""},{"$f":"'2DOPA'!AO60","v":""},{"$f":"'2DOPA'!AQ60","v":""},{"$f":"'3ERPA'!AM60","v":""},{"$f":"'3ERPA'!AO60","v":""},{"$f":"'3ERPA'!AQ60","v":""},"","","","","",""]
["",{"$f":"IF('1ERPA'!F61=\"\",\"\",'1ERPA'!F61)","v":""},{"$f":"'1ERPA'!AM61","v":""},{"$f":"'1ERPA'!AO61","v":""},{"$f":"'1ERPA'!AQ61","v":""},{"$f":"'2DOPA'!AM61","v":""},{"$f":"'2DOPA'!AO61","v":""},{"$f":"'2DOPA'!AQ61","v":""},{"$f":"'3ERPA'!AM61","v":""},{"$f":"'3ERPA'!AO61","v":""},{"$f":"'3ERPA'!AQ61","v":""},"","","","","",""]
["",{"$f":"IF('1ERPA'!F62=\"\",\"\",'1ERPA'!F62)","v":""},{"$f":"'1ERPA'!AM62","v":""},{"$f":"'1ERPA'!AO62","v":""},{"$f":"'1ERPA'!AQ62","v":""},{"$f":"'2DOPA'!AM62","v":""},{"$f":"'2DOPA'!AO62","v":""},{"$f":"'2DOPA'!AQ62","v":""},{"$f":"'3ERPA'!AM62","v":""},{"$f":"'3ERPA'!AO62","v":""},{"$f":"'3ERPA'!AQ62","v":""},"","","","","",""]
["",{"$f":"IF('1ERPA'!F63=\"\",\"\",'1ERPA'!F63)","v":""},{"$f":"'1ERPA'!AM63","v":""},{"$f":"'1ERPA'!AO63","v":""},{"$f":"'1ERPA'!AQ63","v":""},{"$f":"'2DOPA'!AM63","v":""},{"$f":"'2DOPA'!AO63","v":""},{"$f":"'2DOPA'!AQ63","v":""},{"$f":"'3ERPA'!AM63","v":""},{"$f":"'3ERPA'!AO63","v":""},{"$f":"'3ERPA'!AQ63","v":""},"","","","","",""]
["",{"$f":"IF('1ERPA'!F64=\"\",\"\",'1ERPA'!F64)","v":""},{"$f":"'1ERPA'!AM64","v":""},{"$f":"'1ERPA'!AO64","v":""},{"$f":"'1ERPA'!AQ64","v":""},{"$f":"'2DOPA'!AM64","v":""},{"$f":"'2DOPA'!AO64","v":""},{"$f":"'2DOPA'!AQ64","v":""},{"$f":"'3ERPA'!AM64","v":""},{"$f":"'3ERPA'!AO64","v":""},{"$f":"'3ERPA'!AQ64","v":""},"","","","","",""]
["",{"$f":"IF('1ERPA'!F65=\"\",\"\",'1ERPA'!F65)","v":""},{"$f":"'1ERPA'!AM65","v":""},{"$f":"'1ERPA'!AO65","v":""},{"$f":"'1ERPA'!AQ65","v":""},{"$f":"'2DOPA'!AM65","v":""},{"$f":"'2DOPA'!AO65","v":""},{"$f":"'2DOPA'!AQ65","v":""},{"$f":"'3ERPA'!AM65","v":""},{"$f":"'3ERPA'!AO65","v":""},{"$f":"'3ERPA'!AQ65","v":""},"","","","","","",null,null,null,null,null,null,{"$f":"'1ERPA'!X10:AI10","v":"ALDO ORTEGA PACHECO"}]
["",{"$f":"IF('1ERPA'!F66=\"\",\"\",'1ERPA'!F66)","v":""},{"$f":"'1ERPA'!AM66","v":""},{"$f":"'1ERPA'!AO66","v":""},{"$f":"'1ERPA'!AQ66","v":""},{"$f":"'2DOPA'!AM66","v":""},{"$f":"'2DOPA'!AO66","v":""},{"$f":"'2DOPA'!AQ66","v":""},{"$f":"'3ERPA'!AM66","v":""},{"$f":"'3ERPA'!AO66","v":""},{"$f":"'3ERPA'!AQ66","v":""},"","","","","","",null,null,null,null,null,null,"NOMBRE Y FIRMA DEL CATEDRÁTICO"]

{"sheet":"RUBRICA","index":10,"n_rows":50,"n_cols":9,"rows_kept":50,"cut":false,"hidden":false,"merged":[[0,7,1,7]]}
[0.5,0,{"$f":"($A$1/5)*1","v":0.1},{"$f":"($A$1/5)*2","v":0.2},{"$f":"($A$1/5)*3","v":0.30000000000000004},{"$f":"($A$1/5)*4","v":0.4},{"$f":"($A$1/5)*5","v":0.5},{"$f":"COUNTA(H3:H50)*A1","v":0.5},{"$f":"(100%/H1)*SUM(I3:I50)","v":0.60000000000000009}]
["ITEM","Sin Nivel","Pre-Formal","Receptivo","Resolutivo","Autónomo","Estratégico",null,{"$f":"(I1/1)*10","v":6.0000000000000009}]
["ID",1,2,3,4,5,6,"Resolutivo",{"$f":"IF(A3=\"\",\"\",(IF(H3=\"\",0,IF(H3=\"Sin Nivel\",$B$1,IF(H3=\"Pre-Formal\",($C$1),IF(H3=\"Receptivo\",($D$1),IF(H3=\"Resolutivo\",($E$1),IF(H3=\"Autónomo\",($F$1)*90%,IF(H3=\"Estratégico\",($G$1),0)))))))))","v":0.30000000000000004}]
[null,null,null,null,null,null,null,null,{"$f":"IF(A4=\"\",\"\",(IF(H4=\"\",0,IF(H4=\"Sin Nivel\",$B$1,IF(H4=\"Pre-Formal\",($C$1),IF(H4=\"Receptivo\",($D$1),IF(H4=\"Resolutivo\",($E$1),IF(H4=\"Autónomo\",($F$1)*90%,IF(H4=\"Estratégico\",($G$1),0)))))))))","v":""}]
[null,null,null,null,null,null,null,null,{"$f":"IF(A5=\"\",\"\",(IF(H5=\"\",0,IF(H5=\"Sin Nivel\",$B$1,IF(H5=\"Pre-Formal\",($C$1),IF(H5=\"Receptivo\",($D$1),IF(H5=\"Resolutivo\",($E$1),IF(H5=\"Autónomo\",($F$1)*90%,IF(H5=\"Estratégico\",($G$1),0)))))))))","v":""}]
[null,null,null,null,null,null,null,null,""]
[null,null,null,null,null,null,null,null,""]
[null,null,null,null,null,null,null,null,""]
[null,null,null,null,null,null,null,null,""]
[null,null,null,null,null,null,null,null,""]
[null,null,null,null,null,null,null,null,""]
[null,null,null,null,null,null,null,null,""]
[null,null,null,null,null,null,null,null,""]
[null,null,null,null,null,null,null,null,""]
[null,null,null,null,null,null,null,null,""]
[null,null,null,null,null,null,null,null,""]
[null,null,null,null,null,null,null,null,""]
[null,null,null,null,null,null,null,null,""]
[null,null,null,null,null,null,null,null,""]
[null,null,null,null,null,null,null,null,""]
[null,null,null,null,null,null,null,null,""]
[null,null,null,null,null,null,null,null,""]
[null,null,null,null,null,null,null,null,""]
[null,null,null,null,null,null,null,null,""]
[null,null,null,null,null,null,null,null,""]
[null,null,null,null,null,null,null,null,""]
[null,null,null,null,null,null,null,null,""]
[null,null,null,null,null,null,null,null,""]
[null,null,null,null,null,null,null,null,""]
[null,null,null,null,null,null,null,null,""]
[null,null,null,null,null,null,null,null,""]
[null,null,null,null,null,null,null,null,""]
[null,null,null,null,null,null,null,null,""]
[null,null,null,null,null,null,null,null,""]
[null,null,null,null,null,null,null,null,""]
[null,null,null,null,null,null,null,null,""]
[null,null,null,null,null,null,null,null,""]
[null,null,null,null,null,null,null,null,""]
[null,null,null,null,null,null,null,null,""]
[null,null,null,null,null,null,null,null,""]
[null,null,null,null,null,null,null,null,""]
[null,null,null,null,null,null,null,null,""]
[null,null,null,null,null,null,null,null,""]
[null,null,null,null,null,null,null,null,""]
[null,null,null,null,null,null,null,null,""]
[null,null,null,null,null,null,null,null,""]
[null,null,null,null,null,null,null,null,""]
[null,null,null,null,null,null,null,null,""]
[null,null,null,null,null,null,null,null,""]
[null,null,null,null,null,null,null,null,""]

{"sheet":"Hoja1","index":11,"n_rows":25,"n_cols":9,"rows_kept":25,"cut":false,"hidden":true,"merged":[]}
[]
[]
[]
[]
[]
[]
[]
[]
[]
[]
[]
[0.65,{"$f":"(100%/65%)*A12","v":1},null,0.65]
[0.58499999999999996,0.89999999999999991,null,{"$f":"D12*90%","v":0.58500000000000008}]
[0.52,0.79999999999999993,null,{"$f":"D12*80%","v":0.52}]
[0.45500000000000002,0.7]
[0.39,0.6]
[0,0]
[]
[null,null,0.1,0.1,0.1,0.1,0.1,0.15]
[{"$f":"(0.65/5)*0","v":0},0,"Sin Nivel","Sin Nivel","Sin Nivel","Sin Nivel","Sin Nivel","Sin Nivel",{"$f":"IF(C20=\"\",\"\",(IF(C20=\"\",0,IF(C20=\"Sin Nivel\",($C$19)*0,IF(C20=\"Pre-Formal\",($C$19)*60%,IF(C20=\"Receptivo\",($C$19)*70%,IF(C20=\"Resolutivo\",($C$19)*80%,IF(C20=\"Autónomo\",($C$19)*90%,IF(C20=\"Estratégico\",($C$19)*100%,0)))))))+IF(D20=\"\",0,IF(D20=\"Sin Nivel\",($D$19)*0,IF(D20=\"Pre-Formal\",($D$19)*60%,IF(D20=\"Receptivo\",($D$19)*70%,IF(D20=\"Resolutivo\",($D$19)*80%,IF(D20=\"Autónomo\",($D$19)*90%,IF(D20=\"Estratégico\",($D$19)*100%,0)))))))+IF(E20=\"\",0,IF(E20=\"Sin Nivel\",($E$19)*0,IF(E20=\"Pre-Formal\",($E$19)*60%,IF(E20=\"Receptivo\",($E$19)*70%,IF(E20=\"Resolutivo\",($E$19)*80%,IF(E20=\"Autónomo\",($E$19)*90%,IF(E20=\"Estratégico\",($E$19)*100%,0)))))))+IF(F20=\"\",0,IF(F20=\"Sin Nivel\",($F$19)*0,IF(F20=\"Pre-Formal\",($F$19)*60%,IF(F20=\"Receptivo\",($F$19)*70%,IF(F20=\"Resolutivo\",($F$19)*80%,IF(F20=\"Autónomo\",($F$19)*90%,IF(F20=\"Estratégico\",($F$19)*100%,0)))))))+IF(G20=\"\",0,IF(G20=\"Sin Nivel\",($G$19)*0,IF(G20=\"Pre-Formal\",($G$19)*60%,IF(G20=\"Receptivo\",($G$19)*70%,IF(G20=\"Resolutivo\",($G$19)*80%,IF(G20=\"Autónomo\",($G$19)*90%,IF(G20=\"Estratégico\",($G$19)*100%,0)))))))+IF(H20=\"\",0,IF(H20=\"Sin Nivel\",($H$19)*0,IF(H20=\"Pre-Formal\",($H$19)*60%,IF(H20=\"Receptivo\",($H$19)*70%,IF(H20=\"Resolutivo\",($H$19)*80%,IF(H20=\"Autónomo\",($H$19)*90%,IF(H20=\"Estratégico\",($H$19)*100%,0)))))))))","v":0}]
[{"$f":"(0.65/5)*0","v":0},0.39,"Pre-Formal","Pre-Formal","Pre-Formal","Pre-Formal","Pre-Formal","Pre-Formal",0.39]
[{"$f":"(0.65/5)*0","v":0},0.45500000000000002,"Receptivo","Receptivo","Receptivo","Receptivo","Receptivo","Receptivo",0.45499999999999996]
[{"$f":"(0.65/5)*0","v":0},0.52,"Resolutivo","Resolutivo","Resolutivo","Resolutivo","Resolutivo","Resolutivo",0.52]
[{"$f":"(0.65/5)*5","v":0.65},0.58499999999999996,"Autónomo","Autónomo","Autónomo","Autónomo","Autónomo","Autónomo",0.58500000000000008]
[{"$f":"(0.65/5)*5","v":0.65},0.65,"Estratégico","Estratégico","Estratégico","Estratégico","Estratégico","Estratégico",0.65]